{"text_format":"1","workbook":"xlsx","n_sheets":23,"sheets":["Anleitung","Select","MR_Quali","MR16_Baum","MR16","MR16_Set","MRX16","MR16F","MR16_Ergebnis","MR8_Baum","MR8","MR8_Set","MRX8","MR8_Ergebnis","MC_Quali","MC16_Baum","MC16","MCX16","MC16_Ergebnis","MC8_Baum","MC8","MCX8","MC8_Ergebnis"],"not_rendered":{"charts":0,"images":18,"macros":1,"external_links":0,"defined_names":70,"comments":11,"pivot_tables":0},"unopened":[],"bounds":{"document_bytes":16777216,"sheet_cells":100000,"rows_first":2000,"rows_last":500,"rows_between":2000,"halvings":0,"cell_chars":16384,"cell_head_chars":4096},"cells_cut":0,"cells_raw":0,"read":"whole","date_system":"1900"}

{"sheet":"Anleitung","index":0,"n_rows":43,"n_cols":2,"rows_kept":43,"cut":false,"hidden":false,"merged":[[0,0,0,1],[42,0,42,1]]}
["Anleitung"]
[]
["1.","Grundsätzliches"]
[]
[null,"Die Datei enthält einen Satz Datenblätter für Recurve Mannschafts- und Mixed Team-Finale (orange) und einen Satz Datenblätter für das Compound Mannschafts und Mixed Team Finale (gelb). Die Finale unterscheiden sich bei den Scorezetteln (Set-System bei Recurve, Match-System bei Compound)."]
[]
["2.","Vorarbeiten"]
[]
[null,"Die erforderlichen Dateien anlegen. In einer Datei kann ein Finale nach Set-System und ein Finale nach Match-System gleichzeitig abgebildet werden (z.B. Mannschaften Recurve und Compound Damen)"]
[null,"Das jeweilige Kästchen \"Auswahl Finale\" anklicken, dadurch kommt rechts unten ein Pulldown-Dreieck zum Vorschein; dieses aufklappen und das gewünschte Finale auswählen und anschließend auf den Button \"Einblenden\" drücken."]
[null,"Wird nur ein Halbfinale (4 Teilnehmer) benötigt, ist das 1/4-Finale zu verwenden. Durch Eingabe * im Ergebnis steigen die Teilnehmer automatisch ins Halbfinale auf (siehe Abschnitt \"Baum\")."]
[null,"Je Bogenklasse werden folgende Blätter angelegt:"]
[null,"*  _Quali"]
[null,"*  _Baum (z.B.: MR16_Baum, MC8_Baum)"]
[null,"*  dazugeörende Scoreblätter (z.B.: MR16, MC8, MCX16 für Mixed Team)"]
[null,"*  das dazugehörende Ergebnisblatt  (z.B.: MR16_Ergebnis, MC8_Ergebnis)"]
[null,"Die Grunddaten im Blatt \"Select\" erfassen, diese werden automatisch auf alle Seiten übertragen."]
[]
["3.","Qualifikationsblatt"]
[]
[null,"Dieses Blatt bildet die Basis für die Folgeseiten. Die Werte müssen aus dem Grunddurchgang spaltenberecht übernommen werden (Junioren, Senioren nicht vergessen!!)."]
[]
["4.","Baum"]
[]
[null,"Die Paarungen werden aus dem Quali-Blatt automatisch übernommen."]
[null,"Die Scheibeneinteilung ist im Baum vorzunehmen. Die 1. Scheibe ist einzugeben (weisses Feld), die folgenden Scheibennummern werden automatisch vergeben."]
[null,"Der Button \"Ergebnisse löschen\" löscht alle eingegebenen Ergebnisse, nur die Grundpaarungen bleiben erhalten (für Versuche recht praktisch)."]
[null,"Die Ergebnisse sind einzutragen, die Sieger werden automatisch in die nächste Runde weitergeschrieben."]
[null,"Bei einem Stechen bei Compound ist beim Sieger ein * beim Ergebnis anzuhängen (z.B. 145*). Wird nach dem Setsystem geschossen bekommt der Sieger des Stechens einen Punkt dazu und gewinnt somit 5:4."]
[null,"Hat ein Team keinen Gegner ist im Ergebnis ein * einzutragen, damit die Daten automatisch in die nächste Runde weitergeschrieben werden."]
[]
["5.","Scoreblätter"]
[]
[null,"Je Team wird ein Scorezettel erstellt. Grunddaten, Name, Verein und Scheibeneinteilung bis zum Halbfinale sind bereits ausgefüllt. Ein Team behält den Zettel bis zu seinem Ausscheiden. Der Verlierer des Halbfinales behält den Zettel für das \"kleine Finale\". "]
[]
["6.","Ergebnis"]
[]
[null,"Über den Button \"Sortieren\" gelangen die Ergebnisse aus dem Baum in diese Liste. "]
[null,"Manuelle Korrekturen in der Ergebnisliste sind möglich, die ausgeblendeten Spalten L-Q dürfen auf keinen Fall zerstört werden!!!"]
[]
[]
[]
["Etwaige Fehler bitte per Mail an schiedsrichter@oebsv.com bekannt geben - Danke."]

{"sheet":"Select","index":1,"n_rows":20,"n_cols":11,"rows_kept":20,"cut":false,"hidden":false,"merged":[[1,6,1,10],[13,2,13,3],[0,1,0,3],[9,1,9,3],[11,2,11,3],[12,2,12,3]]}
[null,"Auswahl der Blätter"]
[null,null,null,null,null,null,"!!!!!!!!!!   DO NOT DELETE   !!!!!!!!!!"]
[null,"Klasse","Auswahl Finale","Blätter anzeigen",null,null,"NEU","ALT"]
[null,null,null,null,null,null,null,null,null,"Kein Finale",0]
[null,"Mannschaft 1 (SET-System)","Kein Finale",null,null,null,{"$f":"VLOOKUP(C5,$J$7:$K$11,2,FALSE)","v":0},0]
[]
[null,"Mannschaft 2 (MATCH-System)","Kein Finale",null,null,null,{"$f":"VLOOKUP(C7,$J$7:$K$11,2,FALSE)","v":0},0,null,"Kein Finale",0]
[null,null,null,null,null,null,null,null,null,"1/4 Finale (8 Mannschaften)",1]
[null,null,null,null,null,null,null,0,null,"1/8 Elimination (16 Mannschaften)",2]
[null,"Die hier eingegebenen Daten werden auf alle dahinter liegenden Blätter übernommen.",null,null,null,null,null,null,null,"1/4 Finale (8 Mixed Teams)",3]
[null,null,null,null,null,null,null,0,null,"1/8 Elimination (16 Mixed Teams)",4]
[null,"Veranstaltungstitel","ÖM Indoor 2019"]
[null,"Datum","09.-10. Februar 2019"]
[null,"Bewerb","Mannschaftsbewerb"]
[]
[]
[null,"variables Feld","Inhalt"]
[null,"Mannschaft 1 (SET-System)","Instinktivbogen Herren"]
[]
[null,"Mannschaft 2 (MATCH-System)","Compound Damen"]

{"sheet":"MR_Quali","index":2,"n_rows":36,"n_cols":8,"rows_kept":36,"cut":false,"hidden":true,"merged":[[1,0,1,3],[2,0,2,3],[4,0,4,3],[6,0,6,3]]}
[]
[{"$f":"Select!$C$12","v":"ÖM Indoor 2019"}]
[{"$f":"Select!C13","v":"09.-10. Februar 2019"}]
[]
["Qualifikationsrunde"]
[]
[{"$f":"CONCATENATE(Select!C14,\" \",Select!C18)","v":"Mannschaftsbewerb Instinktivbogen Herren"}]
[]
["Pl.","Start-Nr.","Name","Schützen","10er","9er","Quali.","SO"]
[{"$f":"IF(C10>\" \",1,\"\")","v":1},null,"RM_1","Schütze1_RM1 Schütze2_RM1",21,25,632]
[{"$f":"IF(C11>\" \",A10+1,\"\")","v":2},null,"RM_2","Schütze1_RM2 Schütze2_RM2",20,24,631]
[{"$f":"IF(C12>\" \",A11+1,\"\")","v":3},null,"RM_3","Schütze1_RM3 Schütze2_RM3",19,23,630]
[4,null,"RM_4","Schütze1_RM4 Schütze2_RM4",18,22,629]
[5,null,"RM_5","Schütze1_RM5 Schütze2_RM5",17,21,628]
[6,null,"RM_6","Schütze1_RM6 Schütze2_RM6",16,20,627]
[7,null,"RM_7","Schütze1_RM7 Schütze2_RM7",15,19,626]
[8,null,"RM_8","Schütze1_RM8 Schütze2_RM8",14,18,625]
[9,null,"RM_9","Schütze1_RM9 Schütze2_RM9",13,17,624]
[10,null,"RM_10","Schütze1_RM10 Schütze2_RM10",12,16,623]
[11,null,"RM_11","Schütze1_RM11 Schütze2_RM11",11,15,622]
[12,null,"RM_12","Schütze1_RM12  Schütze2_RM12",10,14,621]
[13,null,"RM_13","Schütze1_RM13  Schütze2_RM13 ",9,13,620]
[14,null,"RM_14","Schütze1_RM14 Schütze2_RM14 ",8,12,619]
[15,null,"RM_15","Schütze1_RM15 Schütze2_RM15",7,11,618]
[16,null,"RM_16","Schütze1_RM16  Schütze2_RM16",6,10,617]
[17,null,"RM_17","Schütze1_RM17  Schütze2_RM17",5,9,616]
[18,null,"RM_18","Schütze1_RM18  Schütze2_RM18",4,8,615]
[19,null,"RM_19","Schütze1_RM19  Schütze2_RM19",3,7,614]
[20,null,"RM_20","Schütze1_RM20  Schütze2_RM20 ",2,6,613]
[21,null,"RM_21","Schütze1_RM21  Schütze2_RM21",1,5,612]
[22,null,"RM_22","Schütze1_RM22  Schütze2_RM22",0,4,611]
[23,null,"RM_23","Schütze1_RM23  Schütze2_RM23",1,3,610]
[24,null,"RM_24","Schütze1_RM24  Schütze2_RM24",2,2,609]
[25,null,"RM_25","Schütze1_RM25  Schütze2_RM25",3,1,608]
[26,null,"RM_26","Schütze1_RM26  Schütze2_RM26",4,0,607]
[27,null,"RM_27","Schütze1_RM27  Schütze2_RM27",5,1,606]

{"sheet":"MR16_Baum","index":3,"n_rows":70,"n_cols":16,"rows_kept":70,"cut":false,"hidden":true,"merged":[[10,13,11,13],[10,14,10,15],[11,9,12,9],[11,14,11,15],[13,9,14,9],[1,10,2,15],[3,10,4,15],[5,5,6,5],[6,13,7,13],[6,14,6,15],[7,5,8,5],[7,14,7,15],[8,13,9,13],[8,14,8,15],[9,14,9,15],[20,13,21,13],[22,13,23,13],[26,13,27,13],[28,13,29,13],[29,5,30,5],[16,1,17,1],[20,1,21,1],[31,5,32,5],[19,5,20,5],[17,5,18,5],[22,1,23,1],[26,1,27,1],[28,1,29,1],[2,1,3,1],[4,1,5,1],[8,1,9,1],[10,1,11,1],[14,1,15,1],[49,2,50,3],[32,1,33,1],[34,1,35,1],[45,11,46,15],[40,1,41,1],[44,1,45,1],[46,1,47,1],[38,1,39,1],[43,5,44,5],[47,6,48,7],[35,9,36,9],[37,9,38,9],[38,14,39,15],[41,5,42,5],[41,10,42,11]]}
[]
[null,"Schb","Name","Erg.",null,null,null,null,null,null,{"$f":"Select!C12","v":"ÖM Indoor 2019"}]
[null,{"$f":"D55","v":31},{"$f":"MR_Quali!C10","v":"RM_1"}]
[1,null,{"$f":"MR_Quali!D10","v":"Schütze1_RM1 Schütze2_RM1"},{"$f":"MR_Quali!G10","v":632},"Quali.",null,null,null,null,null,{"$f":"Select!C13","v":"09.-10. Februar 2019"}]
[16,{"$f":"D56","v":32},{"$f":"MR_Quali!C25","v":"RM_16"},null,null,"Schb","Name","Erg."]
[null,null,{"$f":"MR_Quali!D25","v":"Schütze1_RM16  Schütze2_RM16"},{"$f":"MR_Quali!G25","v":617},"Quali.",{"$f":"H55","v":21},{"$f":"IF($D3>$D5,$C3,IF($D5>$D3,$C5,IF(RIGHT($D3,1)=\"*\",$C3,IF(RIGHT($D5,1)=\"*\",$C5,\"\"))))","v":""}]
[null,null,null,null,null,null,{"$f":"IF($D3>$D5,$C4,IF($D5>$D3,$C6,IF(RIGHT($D3,1)=\"*\",$C4,IF(RIGHT($D5,1)=\"*\",$C6,\"\"))))","v":""},null,null,null,null,null,null,"1.",{"$f":"IF($P$21>$P$23,$O$21,IF($P$23>$P$21,$O$23,IF(RIGHT($P$21,1)=\"*\",$O$21,IF(RIGHT($P$23,1)=\"*\",$O$23,\"\"))))","v":""}]
[null,null,null,null,null,{"$f":"H56","v":22},{"$f":"IF($D9>$D11,$C9,IF($D11>$D9,$C11,IF(RIGHT($D9,1)=\"*\",$C9,IF(RIGHT($D11,1)=\"*\",$C11,\"\"))))","v":""},null,null,null,null,null,null,null,{"$f":"IF($P$21>$P$23,$O$22,IF($P$23>$P$21,$O$24,IF(RIGHT($P$21,1)=\"*\",$O$22,IF(RIGHT($P$23,1)=\"*\",$O$24,\"\"))))","v":""}]
[null,{"$f":"D57","v":33},{"$f":"MR_Quali!C18","v":"RM_9"},null,null,null,{"$f":"IF($D9>$D11,$C10,IF($D11>$D9,$C12,IF(RIGHT($D9,1)=\"*\",$C10,IF(RIGHT($D11,1)=\"*\",$C12,\"\"))))","v":""},null,null,null,null,null,null,"2.",{"$f":"IF($P$21<$P$23,$O$21,IF($P$23<$P$21,$O$23,IF(RIGHT($P$21,1)=\"\",$O$21,IF(RIGHT($P$23,1)=\"\",$O$23,\"\"))))","v":""}]
[9,null,{"$f":"MR_Quali!D18","v":"Schütze1_RM9 Schütze2_RM9"},{"$f":"MR_Quali!G18","v":624},"Quali.",null,null,null,null,null,null,null,null,null,{"$f":"IF($P$21<$P$23,$O$22,IF($P$23<$P$21,$O$24,IF(RIGHT($P$21,1)=\"\",$O$22,IF(RIGHT($P$23,1)=\"\",$O$24,\"\"))))","v":""}]
[8,{"$f":"D58","v":34},{"$f":"MR_Quali!C17","v":"RM_8"},null,null,null,null,null,null,"Schb","Name","Erg.",null,"3.",{"$f":"IF($P$27>$P$29,$O$27,IF($P$29>$P$27,$O$29,IF(RIGHT($P$27,1)=\"*\",$O$27,IF(RIGHT($P$29,1)=\"*\",$O$29,\"\"))))","v":""}]
[null,null,{"$f":"MR_Quali!D17","v":"Schütze1_RM8 Schütze2_RM8"},{"$f":"MR_Quali!G17","v":625},"Quali.",null,null,null,null,{"$f":"L55","v":11},{"$f":"IF($H6>$H8,$G6,IF($H8>$H6,$G8,IF(RIGHT($H6,1)=\"*\",$G6,IF(RIGHT($H8,1)=\"*\",$G8,\"\"))))","v":""},null,null,null,{"$f":"IF($P$27>$P$29,$O$28,IF($P$29>$P$27,$O$30,IF(RIGHT($P$27,1)=\"*\",$O$28,IF(RIGHT($P$29,1)=\"*\",$O$30,\"\"))))","v":""}]
[null,null,null,null,null,null,null,null,null,null,{"$f":"IF($H6>$H8,$G7,IF($H8>$H6,$G9,IF(RIGHT($H6,1)=\"*\",$G7,IF(RIGHT($H8,1)=\"*\",$G9,\"\"))))","v":""}]
[null,null,null,null,null,null,null,null,null,{"$f":"L56","v":12},{"$f":"IF($H18>$H20,$G18,IF($H20>$H18,$G20,IF(RIGHT($H18,1)=\"*\",$G18,IF(RIGHT($H20,1)=\"*\",$G20,\"\"))))","v":""}]
[null,{"$f":"D59","v":35},{"$f":"MR_Quali!C14","v":"RM_5"},null,null,null,null,null,null,null,{"$f":"IF($H18>$H20,$G19,IF($H20>$H18,$G21,IF(RIGHT($H18,1)=\"*\",$G19,IF(RIGHT($H20,1)=\"*\",$G21,\"\"))))","v":""}]
[5,null,{"$f":"MR_Quali!D14","v":"Schütze1_RM5 Schütze2_RM5"},{"$f":"MR_Quali!G14","v":628},"Quali."]
[12,{"$f":"D60","v":36},{"$f":"MR_Quali!C21","v":"RM_12"}]
[null,null,{"$f":"MR_Quali!D21","v":"Schütze1_RM12  Schütze2_RM12"},{"$f":"MR_Quali!G23","v":619},"Quali.",{"$f":"H57","v":23},{"$f":"IF($D15>$D17,$C15,IF($D17>$D15,$C17,IF(RIGHT($D15,1)=\"*\",$C15,IF(RIGHT($D17,1)=\"*\",$C17,\"\"))))","v":""},null,null,null,null,null,null,null,""]
[null,null,null,null,null,null,{"$f":"IF($D15>$D17,$C16,IF($D17>$D15,$C18,IF(RIGHT($D15,1)=\"*\",$C16,IF(RIGHT($D17,1)=\"*\",$C18,\"\"))))","v":""},null,null,null,null,null,null,null,""]
[null,null,null,null,null,{"$f":"H58","v":24},{"$f":"IF($D21>$D23,$C21,IF($D23>$D21,$C23,IF(RIGHT($D21,1)=\"*\",$C21,IF(RIGHT($D23,1)=\"*\",$C23,\"\"))))","v":""},null,null,null,null,null,null,"Schb","Name","Erg."]
[null,{"$f":"D61","v":37},{"$f":"MR_Quali!C22","v":"RM_13"},null,null,null,{"$f":"IF($D21>$D23,$C22,IF($D23>$D21,$C24,IF(RIGHT($D21,1)=\"*\",$C22,IF(RIGHT($D23,1)=\"*\",$C24,\"\"))))","v":""},null,null,null,null,null,null,{"$f":"P55","v":41},{"$f":"IF($L12>$L14,$K12,IF($L14>$L12,$K14,IF(RIGHT($L12,1)=\"*\",$K12,IF(RIGHT($L14,1)=\"*\",$K14,\"\"))))","v":""}]
[13,null,{"$f":"MR_Quali!D22","v":"Schütze1_RM13  Schütze2_RM13 "},{"$f":"MR_Quali!G22","v":620},"Quali.",null,null,null,null,null,null,"Finale",null,null,{"$f":"IF($L12>$L14,$K13,IF($L14>$L12,$K15,IF(RIGHT($L12,1)=\"*\",$K13,IF(RIGHT($L14,1)=\"*\",$K15,\"\"))))","v":""}]
[4,{"$f":"D62","v":38},{"$f":"MR_Quali!C13","v":"RM_4"},null,null,null,null,null,null,null,null,"1. und 2. Platz",null,{"$f":"P56","v":42},{"$f":"IF($L36>$L38,$K36,IF($L38>$L36,$K38,IF(RIGHT($L36,1)=\"*\",$K36,IF(RIGHT($L38,1)=\"*\",$K38,\"\"))))","v":""}]
[null,null,{"$f":"MR_Quali!D13","v":"Schütze1_RM4 Schütze2_RM4"},{"$f":"MR_Quali!G13","v":629},"Quali.",null,null,null,null,null,null,null,null,null,{"$f":"IF($L36>$L38,$K37,IF($L38>$L36,$K39,IF(RIGHT($L36,1)=\"*\",$K37,IF(RIGHT($L38,1)=\"*\",$K39,\"\"))))","v":""}]
[]
[]
[null,{"$f":"D63","v":39},{"$f":"MR_Quali!C12","v":"RM_3"},null,null,null,null,null,null,null,null,null,null,{"$f":"P57","v":51},{"$f":"IF($L12<$L14,$K12,IF($L14<$L12,$K14,IF(RIGHT($L12,1)=\"*\",$K14,IF(RIGHT($L14,1)=\"*\",$K12,\"\"))))","v":""}]
[3,null,{"$f":"MR_Quali!D12","v":"Schütze1_RM3 Schütze2_RM3"},{"$f":"MR_Quali!G12","v":630},"Quali.",null,null,null,null,null,null,"Finale",null,null,{"$f":"IF($L12<$L14,$K13,IF($L14<$L12,$K15,IF(RIGHT($L12,1)=\"*\",$K12,IF(RIGHT($L14,1)=\"*\",$K14,\"\"))))","v":""}]
[14,{"$f":"D64","v":40},{"$f":"MR_Quali!C23","v":"RM_14"},null,null,null,null,null,null,null,null,"3. und 4. Platz",null,{"$f":"P58","v":52},{"$f":"IF($L36<$L38,$K36,IF($L38<$L36,$K38,IF(RIGHT($L36,1)=\"*\",$K38,IF(RIGHT($L38,1)=\"*\",$K36,\"\"))))","v":""}]
[null,null,{"$f":"MR_Quali!D23","v":"Schütze1_RM14 Schütze2_RM14 "},{"$f":"MR_Quali!G23","v":619},"Quali.",{"$f":"H59","v":25},{"$f":"IF($D27>$D29,$C27,IF($D29>$D27,$C29,IF(RIGHT($D27,1)=\"*\",$C27,IF(RIGHT($D29,1)=\"*\",$C29,\"\"))))","v":""},null,null,null,null,null,null,null,{"$f":"IF($L36<$L38,$K37,IF($L38<$L36,$K39,IF(RIGHT($L36,1)=\"*\",$K39,IF(RIGHT($L38,1)=\"*\",$K37,\"\"))))","v":""}]
[null,null,null,null,null,null,{"$f":"IF($D27>$D29,$C28,IF($D29>$D27,$C30,IF(RIGHT($D27,1)=\"*\",$C28,IF(RIGHT($D29,1)=\"*\",$C30,\"\"))))","v":""}]
[null,null,null,null,null,{"$f":"H60","v":26},{"$f":"IF($D33>$D35,$C33,IF($D35>$D33,$C35,IF(RIGHT($D33,1)=\"*\",$C33,IF(RIGHT($D35,1)=\"*\",$C35,\"\"))))","v":""}]
[null,{"$f":"D65","v":41},{"$f":"MR_Quali!C20","v":"RM_11"},null,null,null,{"$f":"IF($D33>$D35,$C34,IF($D35>$D33,$C36,IF(RIGHT($D33,1)=\"*\",$C34,IF(RIGHT($D35,1)=\"*\",$C36,\"\"))))","v":""}]
[11,null,{"$f":"MR_Quali!D20","v":"Schütze1_RM11 Schütze2_RM11"},{"$f":"MR_Quali!G20","v":622},"Quali."]
[6,{"$f":"D66","v":42},{"$f":"MR_Quali!C15","v":"RM_6"}]
[null,null,{"$f":"MR_Quali!D15","v":"Schütze1_RM6 Schütze2_RM6"},{"$f":"MR_Quali!G15","v":627},"Quali.",null,null,null,null,{"$f":"L57","v":13},{"$f":"IF($H30>$H32,$G30,IF($H32>$H30,$G32,IF(RIGHT($H30,1)=\"*\",$G30,IF(RIGHT($H32,1)=\"*\",$G32,\"\"))))","v":""}]
[null,null,null,null,null,null,null,null,null,null,{"$f":"IF($H30>$H32,$G31,IF($H32>$H30,$G33,IF(RIGHT($H30,1)=\"*\",$G31,IF(RIGHT($H32,1)=\"*\",$G33,\"\"))))","v":""}]
[null,null,null,null,null,null,null,null,null,{"$f":"L58","v":14},{"$f":"IF($H42>$H44,$G42,IF($H44>$H42,$G44,IF(RIGHT($H42,1)=\"*\",$G42,IF(RIGHT($H44,1)=\"*\",$G44,\"\"))))","v":""}]
[null,{"$f":"D67","v":43},{"$f":"MR_Quali!C16","v":"RM_7"},null,null,null,null,null,null,null,{"$f":"IF($H42>$H44,$G43,IF($H44>$H42,$G45,IF(RIGHT($H42,1)=\"*\",$G43,IF(RIGHT($H44,1)=\"*\",$G45,\"\"))))","v":""},null,null,null,"Finale"]
[7,null,{"$f":"MR_Quali!D16","v":"Schütze1_RM7 Schütze2_RM7"},{"$f":"MR_Quali!G16","v":626},"Quali."]
[10,{"$f":"D68","v":44},{"$f":"MR_Quali!C19","v":"RM_10"}]
[null,null,{"$f":"MR_Quali!D19","v":"Schütze1_RM10 Schütze2_RM10"},{"$f":"MR_Quali!G19","v":623},"Quali.",{"$f":"H61","v":27},{"$f":"IF($D39>$D41,$C39,IF($D41>$D39,$C41,IF(RIGHT($D39,1)=\"*\",$C39,IF(RIGHT($D41,1)=\"*\",$C41,\"\"))))","v":""},null,null,null,"1/2 Finale"]
[null,null,null,null,null,null,{"$f":"IF($D39>$D41,$C40,IF($D41>$D39,$C42,IF(RIGHT($D39,1)=\"*\",$C40,IF(RIGHT($D41,1)=\"*\",$C42,\"\"))))","v":""}]
[null,null,null,null,null,{"$f":"H62","v":28},{"$f":"IF($D45>$D47,$C45,IF($D47>$D45,$C47,IF(RIGHT($D45,1)=\"*\",$C45,IF(RIGHT($D47,1)=\"*\",$C47,\"\"))))","v":""}]
[null,{"$f":"D69","v":45},{"$f":"MR_Quali!C24","v":"RM_15"},null,null,null,{"$f":"IF($D45>$D47,$C46,IF($D47>$D45,$C48,IF(RIGHT($D45,1)=\"*\",$C46,IF(RIGHT($D47,1)=\"*\",$C48,\"\"))))","v":""}]
[15,null,{"$f":"MR_Quali!D24","v":"Schütze1_RM15 Schütze2_RM15"},{"$f":"MR_Quali!G24","v":618},"Quali.",null,null,null,null,null,null,{"$f":"CONCATENATE(Select!C14,\" \",Select!C18)","v":"Mannschaftsbewerb Instinktivbogen Herren"}]
[2,{"$f":"D70","v":46},{"$f":"MR_Quali!C11","v":"RM_2"}]
[null,null,{"$f":"MR_Quali!D11","v":"Schütze1_RM2 Schütze2_RM2"},{"$f":"MR_Quali!G11","v":631},"Quali.",null,"1/4 Finale"]
[null,null,null,null,null,null,null,null,null,null,null,null,null,"*","= Im Stechen gewonnen"]
[null,null,"1/8 Elimination"]
[]
[]
[]
[null,null,"Scheibe:",null,null,null,"Scheibe:"]
[null,1,{"$f":"CONCATENATE($G$54,\" \",D55)","v":"Scheibe: 31"},31,null,1,{"$f":"CONCATENATE($G$54,\" \",H55)","v":"Scheibe: 21"},21,null,1,{"$f":"CONCATENATE($G$54,\" \",L55)","v":"Scheibe: 11"},11,null,1,{"$f":"CONCATENATE($G$54,\" \",P55)","v":"Scheibe: 41"},41]
[null,null,"Scheibe: 32",{"$f":"IF(RIGHT(D55,1)=\"A\",CONCATENATE(LEFT(D55,LEN(D55)-1),\"B\"),D55+1)","v":32},null,null,"Scheibe: 22",{"$f":"IF(RIGHT(H55,1)=\"A\",CONCATENATE(LEFT(H55,LEN(H55)-1),\"B\"),H55+1)","v":22},null,null,{"$f":"CONCATENATE($G$54,\" \",L56)","v":"Scheibe: 12"},{"$f":"IF(RIGHT(L55,1)=\"A\",CONCATENATE(LEFT(L55,LEN(L55)-1),\"B\"),L55+1)","v":12},null,null,{"$f":"CONCATENATE($G$54,\" \",P56)","v":"Scheibe: 42"},{"$f":"IF(RIGHT(P55,1)=\"A\",CONCATENATE(LEFT(P55,LEN(P55)-1),\"B\"),P55+1)","v":42}]
[null,{"$f":"B55+1","v":2},"Scheibe: 33",{"$f":"IF(RIGHT(D56,1)=\"B\",CONCATENATE(LEFT(D56,LEN(D56)-1)+1,\"A\"),D56+1)","v":33},null,{"$f":"F55+1","v":2},"Scheibe: 23",{"$f":"IF(RIGHT(H56,1)=\"B\",CONCATENATE(LEFT(H56,LEN(H56)-1)+1,\"A\"),H56+1)","v":23},null,{"$f":"J55+1","v":2},{"$f":"CONCATENATE($G$54,\" \",L57)","v":"Scheibe: 13"},{"$f":"IF(RIGHT(L56,1)=\"B\",CONCATENATE(LEFT(L56,LEN(L56)-1)+1,\"A\"),L56+1)","v":13},null,{"$f":"N55+1","v":2},{"$f":"CONCATENATE($G$54,\" \",P57)","v":"Scheibe: 51"},51]
[null,null,"Scheibe: 34",{"$f":"IF(RIGHT(D57,1)=\"A\",CONCATENATE(LEFT(D57,LEN(D57)-1),\"B\"),D57+1)","v":34},null,null,"Scheibe: 24",{"$f":"IF(RIGHT(H57,1)=\"A\",CONCATENATE(LEFT(H57,LEN(H57)-1),\"B\"),H57+1)","v":24},null,null,{"$f":"CONCATENATE($G$54,\" \",L58)","v":"Scheibe: 14"},{"$f":"IF(RIGHT(L57,1)=\"A\",CONCATENATE(LEFT(L57,LEN(L57)-1),\"B\"),L57+1)","v":14},null,null,{"$f":"CONCATENATE($G$54,\" \",P58)","v":"Scheibe: 52"},{"$f":"IF(RIGHT(P57,1)=\"A\",CONCATENATE(LEFT(P57,LEN(P57)-1),\"B\"),P57+1)","v":52}]
[null,{"$f":"B57+1","v":3},"Scheibe: 35",{"$f":"IF(RIGHT(D58,1)=\"B\",CONCATENATE(LEFT(D58,LEN(D58)-1)+1,\"A\"),D58+1)","v":35},null,{"$f":"F57+1","v":3},"Scheibe: 25",{"$f":"IF(RIGHT(H58,1)=\"B\",CONCATENATE(LEFT(H58,LEN(H58)-1)+1,\"A\"),H58+1)","v":25}]
[null,null,"Scheibe: 36",{"$f":"IF(RIGHT(D59,1)=\"A\",CONCATENATE(LEFT(D59,LEN(D59)-1),\"B\"),D59+1)","v":36},null,null,"Scheibe: 26",{"$f":"IF(RIGHT(H59,1)=\"A\",CONCATENATE(LEFT(H59,LEN(H59)-1),\"B\"),H59+1)","v":26}]
[null,{"$f":"B59+1","v":4},"Scheibe: 37",{"$f":"IF(RIGHT(D60,1)=\"B\",CONCATENATE(LEFT(D60,LEN(D60)-1)+1,\"A\"),D60+1)","v":37},null,{"$f":"F59+1","v":4},"Scheibe: 27",{"$f":"IF(RIGHT(H60,1)=\"B\",CONCATENATE(LEFT(H60,LEN(H60)-1)+1,\"A\"),H60+1)","v":27}]
[null,null,"Scheibe: 38",{"$f":"IF(RIGHT(D61,1)=\"A\",CONCATENATE(LEFT(D61,LEN(D61)-1),\"B\"),D61+1)","v":38},null,null,"Scheibe: 28",{"$f":"IF(RIGHT(H61,1)=\"A\",CONCATENATE(LEFT(H61,LEN(H61)-1),\"B\"),H61+1)","v":28}]
[null,{"$f":"B61+1","v":5},{"$f":"CONCATENATE($G$54,\" \",D63)","v":"Scheibe: 39"},{"$f":"IF(RIGHT(D62,1)=\"B\",CONCATENATE(LEFT(D62,LEN(D62)-1)+1,\"A\"),D62+1)","v":39}]
[null,null,"Scheibe: 40",{"$f":"IF(RIGHT(D63,1)=\"A\",CONCATENATE(LEFT(D63,LEN(D63)-1),\"B\"),D63+1)","v":40}]
[null,{"$f":"B63+1","v":6},"Scheibe: 41",{"$f":"IF(RIGHT(D64,1)=\"B\",CONCATENATE(LEFT(D64,LEN(D64)-1)+1,\"A\"),D64+1)","v":41}]
[null,null,"Scheibe: 42",{"$f":"IF(RIGHT(D65,1)=\"A\",CONCATENATE(LEFT(D65,LEN(D65)-1),\"B\"),D65+1)","v":42}]
[null,{"$f":"B65+1","v":7},"Scheibe: 43",{"$f":"IF(RIGHT(D66,1)=\"B\",CONCATENATE(LEFT(D66,LEN(D66)-1)+1,\"A\"),D66+1)","v":43}]
[null,null,"Scheibe: 44",{"$f":"IF(RIGHT(D67,1)=\"A\",CONCATENATE(LEFT(D67,LEN(D67)-1),\"B\"),D67+1)","v":44}]
[null,{"$f":"B67+1","v":8},"Scheibe: 45",{"$f":"IF(RIGHT(D68,1)=\"B\",CONCATENATE(LEFT(D68,LEN(D68)-1)+1,\"A\"),D68+1)","v":45}]
[null,null,"Scheibe: 46",{"$f":"IF(RIGHT(D69,1)=\"A\",CONCATENATE(LEFT(D69,LEN(D69)-1),\"B\"),D69+1)","v":46}]

{"sheet":"MR16","index":4,"n_rows":702,"n_cols":23,"rows_kept":702,"cut":false,"hidden":true,"merged":[[26,19,26,24],[5,16,5,23],[8,0,8,5],[8,6,8,11],[8,13,8,18],[8,19,8,24],[1,0,1,10],[1,16,1,23],[2,0,2,10],[3,0,3,10],[3,16,4,23],[4,0,4,10],[10,0,12,0],[10,13,12,13],[13,0,15,0],[13,13,15,13],[16,0,18,0],[16,13,18,13],[20,0,22,0],[20,13,22,13],[5,2,5,10],[28,0,30,0],[28,13,30,13],[26,0,26,5],[26,6,26,11],[26,13,26,18],[31,0,33,0],[31,13,33,13],[34,0,36,0],[34,13,36,13],[181,16,181,23],[184,0,184,5],[184,6,184,11],[184,13,184,18],[45,16,45,23],[46,0,46,10],[47,0,47,10],[47,16,48,23],[48,0,48,10],[64,0,66,0],[64,13,66,13],[70,0,70,5],[70,6,70,11],[70,13,70,18],[70,19,70,24],[49,16,49,23],[52,0,52,5],[52,6,52,11],[52,13,52,18],[52,19,52,24],[98,0,100,0],[98,13,100,13],[101,0,103,0],[101,13,103,13],[89,16,89,23],[90,0,90,10],[91,0,91,10],[91,16,92,23],[92,0,92,10],[93,16,93,23],[96,0,96,5],[96,6,96,11],[96,13,96,18],[96,19,96,24],[93,2,93,10],[184,19,184,24],[186,0,188,0],[186,13,188,13],[189,0,191,0],[189,13,191,13],[313,16,313,23],[316,0,316,5],[316,6,316,11],[316,13,316,18],[316,19,316,24],[223,16,224,23],[274,0,276,0],[274,13,276,13],[277,0,279,0],[277,13,279,13],[272,0,272,5],[290,0,290,5],[290,6,290,11],[290,13,290,18],[221,16,221,23],[202,19,202,24],[210,13,212,13],[214,0,216,0],[214,13,216,13],[295,0,297,0],[295,13,297,13],[298,0,300,0],[298,13,300,13],[265,16,265,23],[236,0,238,0],[236,13,238,13],[240,0,242,0],[240,13,242,13],[265,0,265,10],[290,19,290,24],[292,0,294,0],[228,13,228,18],[228,19,228,24],[280,0,282,0],[280,13,282,13],[258,0,260,0],[258,13,260,13],[225,2,225,10],[269,2,269,10],[292,13,294,13],[399,16,400,23],[400,0,400,10],[365,13,367,13],[368,0,370,0],[368,13,370,13],[357,16,357,23],[339,0,341,0],[339,13,341,13],[342,0,344,0],[342,13,344,13],[353,0,353,10],[353,16,353,23],[354,0,354,10],[355,0,355,10],[355,16,356,23],[356,0,356,10],[372,0,374,0],[372,13,374,13],[398,0,398,10],[360,13,360,18],[360,19,360,24],[360,0,360,5],[380,0,382,0],[362,13,364,13],[536,13,536,18],[536,19,536,24],[529,0,529,10],[529,16,529,23],[530,0,530,10],[531,0,531,10],[531,16,532,23],[532,0,532,10],[548,0,550,0],[548,13,550,13],[544,0,546,0],[544,13,546,13],[533,16,533,23],[536,0,536,5],[533,2,533,10],[401,16,401,23],[404,0,404,5],[404,6,404,11],[404,13,404,18],[404,19,404,24],[441,16,441,23],[442,0,442,10],[443,0,443,10],[443,16,444,23],[422,13,422,18],[422,19,422,24],[424,0,426,0],[424,13,426,13],[409,0,411,0],[409,13,411,13],[412,0,414,0],[412,13,414,13],[416,0,418,0],[416,13,418,13],[422,0,422,5],[422,6,422,11],[510,19,510,24],[489,16,489,23],[492,0,492,5],[492,6,492,11],[492,13,492,18],[492,19,492,24],[510,0,510,5],[510,6,510,11],[510,13,510,18],[179,16,180,23],[180,0,180,10],[221,0,221,10],[202,0,202,5],[202,6,202,11],[272,19,272,24],[246,13,246,18],[246,19,246,24],[248,0,250,0],[248,13,250,13],[251,0,253,0],[251,13,253,13],[254,0,256,0],[254,13,256,13],[246,0,246,5],[246,6,246,11],[266,0,266,10],[267,0,267,10],[267,16,268,23],[268,0,268,10],[269,16,269,23],[225,16,225,23],[228,0,228,5],[228,6,228,11],[512,0,514,0],[512,13,514,13],[515,0,517,0],[284,0,286,0],[284,13,286,13],[309,16,309,23],[310,0,310,10],[311,0,311,10],[311,16,312,23],[312,0,312,10],[397,0,397,10],[397,16,397,23],[378,0,378,5],[378,6,378,11],[378,13,378,18],[378,19,378,24],[336,0,338,0],[336,13,338,13],[334,0,334,5],[334,6,334,11],[334,13,334,18],[346,0,348,0],[346,13,348,13],[362,0,364,0],[445,16,445,23],[448,0,448,5],[448,6,448,11],[448,13,448,18],[448,19,448,24],[450,0,452,0],[450,13,452,13],[453,0,455,0],[453,13,455,13],[466,19,466,24],[468,0,470,0],[468,13,470,13],[471,0,473,0],[497,0,499,0],[497,13,499,13],[500,0,502,0],[500,13,502,13],[504,0,506,0],[504,13,506,13],[478,0,480,0],[478,13,480,13],[466,0,466,5],[466,6,466,11],[466,13,466,18],[485,16,485,23],[486,0,486,10],[487,0,487,10],[487,16,488,23],[488,0,488,10],[494,0,496,0],[494,13,496,13],[474,13,476,13],[471,13,473,13],[515,13,517,13],[518,0,520,0],[518,13,520,13],[573,0,573,10],[573,16,573,23],[574,0,574,10],[575,0,575,10],[575,16,576,23],[576,0,576,10],[541,0,543,0],[541,13,543,13],[522,0,524,0],[522,13,524,13],[538,0,540,0],[538,13,540,13],[536,6,536,11],[556,0,558,0],[556,13,558,13],[559,0,561,0],[559,13,561,13],[562,0,564,0],[562,13,564,13],[566,0,568,0],[566,13,568,13],[554,0,554,5],[554,6,554,11],[554,13,554,18],[554,19,554,24],[617,16,617,23],[618,0,618,10],[619,0,619,10],[619,16,620,23],[620,0,620,10],[582,0,584,0],[582,13,584,13],[585,0,587,0],[585,13,587,13],[588,0,590,0],[588,13,590,13],[592,0,594,0],[592,13,594,13],[580,0,580,5],[580,6,580,11],[580,13,580,18],[580,19,580,24],[577,2,577,10],[600,0,602,0],[600,13,602,13],[603,0,605,0],[603,13,605,13],[606,0,608,0],[606,13,608,13],[610,0,612,0],[610,13,612,13],[577,16,577,23],[89,0,89,10],[108,0,110,0],[108,13,110,13],[116,0,118,0],[116,13,118,13],[624,19,624,24],[642,0,642,5],[642,6,642,11],[642,13,642,18],[642,19,642,24],[624,0,624,5],[624,6,624,11],[624,13,624,18],[626,0,628,0],[626,13,628,13],[629,0,631,0],[629,13,631,13],[632,0,634,0],[632,13,634,13],[621,16,621,23],[598,0,598,5],[598,6,598,11],[598,13,598,18],[598,19,598,24],[38,0,40,0],[38,13,40,13],[54,0,56,0],[54,13,56,13],[57,0,59,0],[57,13,59,13],[60,0,62,0],[60,13,62,13],[82,0,84,0],[82,13,84,13],[72,0,74,0],[72,13,74,13],[75,0,77,0],[75,13,77,13],[78,0,80,0],[78,13,80,13],[45,0,45,10],[49,2,49,10],[114,19,114,24],[114,0,114,5],[104,0,106,0],[104,13,106,13],[119,0,121,0],[119,13,121,13],[122,0,124,0],[122,13,124,13],[160,0,162,0],[160,13,162,13],[140,13,140,18],[114,6,114,11],[114,13,114,18],[158,6,158,11],[158,13,158,18],[126,0,128,0],[126,13,128,13],[140,0,140,5],[140,6,140,11],[133,0,133,10],[133,16,133,23],[134,0,134,10],[135,0,135,10],[135,16,136,23],[136,0,136,10],[137,16,137,23],[140,19,140,24],[158,19,158,24],[142,0,144,0],[142,13,144,13],[163,13,165,13],[166,0,168,0],[166,13,168,13],[145,0,147,0],[163,0,165,0],[137,2,137,10],[145,13,147,13],[148,0,150,0],[148,13,150,13],[152,0,154,0],[152,13,154,13],[158,0,158,5],[170,0,172,0],[170,13,172,13],[230,0,232,0],[230,13,232,13],[233,0,235,0],[233,13,235,13],[177,0,177,10],[223,0,223,10],[192,0,194,0],[192,13,194,13],[196,0,198,0],[196,13,198,13],[204,0,206,0],[204,13,206,13],[207,0,209,0],[207,13,209,13],[210,0,212,0],[224,0,224,10],[222,0,222,10],[181,2,181,10],[202,13,202,18],[177,16,177,23],[178,0,178,10],[179,0,179,10],[406,13,408,13],[334,19,334,24],[272,6,272,11],[272,13,272,18],[383,0,385,0],[383,13,385,13],[386,0,388,0],[386,13,388,13],[390,0,392,0],[390,13,392,13],[380,13,382,13],[321,13,323,13],[324,0,326,0],[324,13,326,13],[328,0,330,0],[328,13,330,13],[302,0,304,0],[302,13,304,13],[309,0,309,10],[365,0,367,0],[360,6,360,11],[321,0,323,0],[318,0,320,0],[318,13,320,13],[427,13,429,13],[430,0,432,0],[430,13,432,13],[434,0,436,0],[434,13,436,13],[456,0,458,0],[456,13,458,13],[460,0,462,0],[460,13,462,13],[444,0,444,10],[650,0,652,0],[650,13,652,13],[636,0,638,0],[636,13,638,13],[644,0,646,0],[644,13,646,13],[647,0,649,0],[647,13,649,13],[617,0,617,10],[621,2,621,10],[654,0,656,0],[654,13,656,13],[670,0,672,0],[670,13,672,13],[673,0,675,0],[673,13,675,13],[665,16,665,23],[668,0,668,5],[668,6,668,11],[668,13,668,18],[668,19,668,24],[661,0,661,10],[661,16,661,23],[662,0,662,10],[663,0,663,10],[663,16,664,23],[664,0,664,10],[665,2,665,10],[686,19,686,24],[698,0,700,0],[698,13,700,13],[676,0,678,0],[676,13,678,13],[680,0,682,0],[680,13,682,13],[688,0,690,0],[688,13,690,13],[691,0,693,0],[691,13,693,13],[686,0,686,5],[686,6,686,11],[686,13,686,18],[694,0,696,0],[694,13,696,13],[313,2,313,10],[357,2,357,10],[401,2,401,10],[445,2,445,10],[489,2,489,10],[399,0,399,10],[474,0,476,0],[441,0,441,10],[485,0,485,10],[427,0,429,0],[406,0,408,0]]}
[]
[{"$f":"Select!$C$12","v":"ÖM Indoor 2019"},null,null,null,null,null,null,null,null,null,null,null,null,"Mannschaft:",null,null,{"$f":"MR16_Baum!$C$3","v":"RM_1"}]
["Veranstaltung"]
[{"$f":"Select!$C$13","v":"09.-10. Februar 2019"},null,null,null,null,null,null,null,null,null,null,null,null,"Schützen:",null,null,{"$f":"MR16_Baum!$C$4","v":"Schütze1_RM1 Schütze2_RM1"}]
["Datum"]
["Bewerb:",null,{"$f":"Select!$C$14","v":"Mannschaftsbewerb"},null,null,null,null,null,null,null,null,null,null,"Bogenklasse:",null,null,{"$f":"Select!$C$18","v":"Instinktivbogen Herren"}]
[]
[]
["1/8 Elimination",null,null,null,null,null,{"$f":"MR16_Baum!$C$55","v":"Scheibe: 31"},null,null,null,null,null,null,"1/4 Finale",null,null,null,null,null,{"$f":"MR16_Baum!$G$55","v":"Scheibe: 21"}]
[null,1,2,"Summe","Punkte","Gesamt",null,null,null,null,null,null,null,null,1,2,"Summe","Punkte","Gesamt"]
[1,null,null,null,null,null,null,null,null,"Stechen",null,null,null,1,null,null,null,null,null,null,null,null,"Stechen"]
[null,null,null,null,null,null,null,null,1,null,null,null,null,null,null,null,null,null,null,null,null,1]
[null,null,null,null,null,null,null,null,2,null,null,null,null,null,null,null,null,null,null,null,null,2]
[2,null,null,null,null,null,null,null,3,null,null,null,null,2,null,null,null,null,null,null,null,3]
[]
[]
[3,null,null,null,null,null,null,null,"Punkte",null,null,null,null,3,null,null,null,null,null,null,null,"Punkte"]
[]
[null,null,null,null,null,null,null,null,"Gesamt",null,null,null,null,null,null,null,null,null,null,null,null,"Gesamt"]
["wenn erforderlich",null,null,null,null,null,null,null,null,null,null,null,null,"wenn erforderlich"]
[4,null,null,null,null,null,null,null,null,null,null,null,null,4]
[null,null,null,null,null,null,null,null,null,"gewonnen",null,null,null,null,null,null,null,null,null,null,null,null,"gewonnen"]
[null,null,null,null,null,null,null,null,null,"verloren",null,null,null,null,null,null,null,null,null,null,null,null,"verloren"]
[null,"Schreiber:",null,null,null,null,null,"Kontrolle:",null,null,null,null,null,null,"Schreiber:",null,null,null,null,null,"Kontrolle:"]
[]
[]
["1/2 Finale",null,null,null,null,null,{"$f":"MR16_Baum!$K$55","v":"Scheibe: 11"},null,null,null,null,null,null,"1./2. od. 3./4. Platz",null,null,null,null,null,"Scheibe:"]
[null,1,2,"Summe","Punkte","Gesamt",null,null,null,null,null,null,null,null,1,2,"Summe","Punkte","Gesamt"]
[1,null,null,null,null,null,null,null,null,"Stechen",null,null,null,1,null,null,null,null,null,null,null,null,"Stechen"]
[null,null,null,null,null,null,null,null,1,null,null,null,null,null,null,null,null,null,null,null,null,1]
[null,null,null,null,null,null,null,null,2,null,null,null,null,null,null,null,null,null,null,null,null,2]
[2,null,null,null,null,null,null,null,3,null,null,null,null,2,null,null,null,null,null,null,null,3]
[]
[]
[3,null,null,null,null,null,null,null,"Punkte",null,null,null,null,3,null,null,null,null,null,null,null,"Punkte"]
[]
[null,null,null,null,null,null,null,null,"Gesamt",null,null,null,null,null,null,null,null,null,null,null,null,"Gesamt"]
["wenn erforderlich",null,null,null,null,null,null,null,null,null,null,null,null,"wenn erforderlich"]
[4,null,null,null,null,null,null,null,null,null,null,null,null,4]
[null,null,null,null,null,null,null,null,null,"gewonnen",null,null,null,null,null,null,null,null,null,null,null,null,"gewonnen"]
[null,null,null,null,null,null,null,null,null,"verloren",null,null,null,null,null,null,null,null,null,null,null,null,"verloren"]
[null,"Schreiber:",null,null,null,null,null,"Kontrolle:",null,null,null,null,null,null,"Schreiber:",null,null,null,null,null,"Kontrolle:"]
[]
[]
[]
[{"$f":"Select!$C$12","v":"ÖM Indoor 2019"},null,null,null,null,null,null,null,null,null,null,null,null,"Mannschaft:",null,null,{"$f":"MR16_Baum!$C$5","v":"RM_16"}]
["Veranstaltung"]
[{"$f":"Select!$C$13","v":"09.-10. Februar 2019"},null,null,null,null,null,null,null,null,null,null,null,null,"Schützen:",null,null,{"$f":"MR16_Baum!$C$6","v":"Schütze1_RM16  Schütze2_RM16"}]
["Datum"]
["Bewerb:",null,{"$f":"Select!$C$14","v":"Mannschaftsbewerb"},null,null,null,null,null,null,null,null,null,null,"Bogenklasse:",null,null,{"$f":"Select!$C$18","v":"Instinktivbogen Herren"}]
[]
[]
["1/8 Elimination",null,null,null,null,null,{"$f":"MR16_Baum!$C$56","v":"Scheibe: 32"},null,null,null,null,null,null,"1/4 Finale",null,null,null,null,null,{"$f":"MR16_Baum!$G$55","v":"Scheibe: 21"}]
[null,1,2,"Summe","Punkte","Gesamt",null,null,null,null,null,null,null,null,1,2,"Summe","Punkte","Gesamt"]
[1,null,null,null,null,null,null,null,null,"Stechen",null,null,null,1,null,null,null,null,null,null,null,null,"Stechen"]
[null,null,null,null,null,null,null,null,1,null,null,null,null,null,null,null,null,null,null,null,null,1]
[null,null,null,null,null,null,null,null,2,null,null,null,null,null,null,null,null,null,null,null,null,2]
[2,null,null,null,null,null,null,null,3,null,null,null,null,2,null,null,null,null,null,null,null,3]
[]
[]
[3,null,null,null,null,null,null,null,"Punkte",null,null,null,null,3,null,null,null,null,null,null,null,"Punkte"]
[]
[null,null,null,null,null,null,null,null,"Gesamt",null,null,null,null,null,null,null,null,null,null,null,null,"Gesamt"]
["wenn erforderlich",null,null,null,null,null,null,null,null,null,null,null,null,"wenn erforderlich"]
[4,null,null,null,null,null,null,null,null,null,null,null,null,4]
[null,null,null,null,null,null,null,null,null,"gewonnen",null,null,null,null,null,null,null,null,null,null,null,null,"gewonnen"]
[null,null,null,null,null,null,null,null,null,"verloren",null,null,null,null,null,null,null,null,null,null,null,null,"verloren"]
[null,"Schreiber:",null,null,null,null,null,"Kontrolle:",null,null,null,null,null,null,"Schreiber:",null,null,null,null,null,"Kontrolle:"]
[]
[]
["1/2 Finale",null,null,null,null,null,{"$f":"MR16_Baum!$K$55","v":"Scheibe: 11"},null,null,null,null,null,null,"1./2. od. 3./4. Platz",null,null,null,null,null,"Scheibe:"]
[null,1,2,"Summe","Punkte","Gesamt",null,null,null,null,null,null,null,null,1,2,"Summe","Punkte","Gesamt"]
[1,null,null,null,null,null,null,null,null,"Stechen",null,null,null,1,null,null,null,null,null,null,null,null,"Stechen"]
[null,null,null,null,null,null,null,null,1,null,null,null,null,null,null,null,null,null,null,null,null,1]
[null,null,null,null,null,null,null,null,2,null,null,null,null,null,null,null,null,null,null,null,null,2]
[2,null,null,null,null,null,null,null,3,null,null,null,null,2,null,null,null,null,null,null,null,3]
[]
[]
[3,null,null,null,null,null,null,null,"Punkte",null,null,null,null,3,null,null,null,null,null,null,null,"Punkte"]
[]
[null,null,null,null,null,null,null,null,"Gesamt",null,null,null,null,null,null,null,null,null,null,null,null,"Gesamt"]
["wenn erforderlich",null,null,null,null,null,null,null,null,null,null,null,null,"wenn erforderlich"]
[4,null,null,null,null,null,null,null,null,null,null,null,null,4]
[null,null,null,null,null,null,null,null,null,"gewonnen",null,null,null,null,null,null,null,null,null,null,null,null,"gewonnen"]
[null,null,null,null,null,null,null,null,null,"verloren",null,null,null,null,null,null,null,null,null,null,null,null,"verloren"]
[null,"Schreiber:",null,null,null,null,null,"Kontrolle:",null,null,null,null,null,null,"Schreiber:",null,null,null,null,null,"Kontrolle:"]
[]
[]
[]
[{"$f":"Select!$C$12","v":"ÖM Indoor 2019"},null,null,null,null,null,null,null,null,null,null,null,null,"Mannschaft:",null,null,{"$f":"MR16_Baum!$C$9","v":"RM_9"}]
["Veranstaltung"]
[{"$f":"Select!$C$13","v":"09.-10. Februar 2019"},null,null,null,null,null,null,null,null,null,null,null,null,"Schützen:",null,null,{"$f":"MR16_Baum!$C$10","v":"Schütze1_RM9 Schütze2_RM9"}]
["Datum"]
["Bewerb:",null,{"$f":"Select!$C$14","v":"Mannschaftsbewerb"},null,null,null,null,null,null,null,null,null,null,"Bogenklasse:",null,null,{"$f":"Select!$C$18","v":"Instinktivbogen Herren"}]
[]
[]
["1/8 Elimination",null,null,null,null,null,{"$f":"MR16_Baum!$C$57","v":"Scheibe: 33"},null,null,null,null,null,null,"1/4 Finale",null,null,null,null,null,{"$f":"MR16_Baum!$G$56","v":"Scheibe: 22"}]
[null,1,2,"Summe","Punkte","Gesamt",null,null,null,null,null,null,null,null,1,2,"Summe","Punkte","Gesamt"]
[1,null,null,null,null,null,null,null,null,"Stechen",null,null,null,1,null,null,null,null,null,null,null,null,"Stechen"]
[null,null,null,null,null,null,null,null,1,null,null,null,null,null,null,null,null,null,null,null,null,1]
[null,null,null,null,null,null,null,null,2,null,null,null,null,null,null,null,null,null,null,null,null,2]
[2,null,null,null,null,null,null,null,3,null,null,null,null,2,null,null,null,null,null,null,null,3]
[]
[]
[3,null,null,null,null,null,null,null,"Punkte",null,null,null,null,3,null,null,null,null,null,null,null,"Punkte"]
[]
[null,null,null,null,null,null,null,null,"Gesamt",null,null,null,null,null,null,null,null,null,null,null,null,"Gesamt"]
["wenn erforderlich",null,null,null,null,null,null,null,null,null,null,null,null,"wenn erforderlich"]
[4,null,null,null,null,null,null,null,null,null,null,null,null,4]
[null,null,null,null,null,null,null,null,null,"gewonnen",null,null,null,null,null,null,null,null,null,null,null,null,"gewonnen"]
[null,null,null,null,null,null,null,null,null,"verloren",null,null,null,null,null,null,null,null,null,null,null,null,"verloren"]
[null,"Schreiber:",null,null,null,null,null,"Kontrolle:",null,null,null,null,null,null,"Schreiber:",null,null,null,null,null,"Kontrolle:"]
[]
[]
["1/2 Finale",null,null,null,null,null,{"$f":"MR16_Baum!$K$55","v":"Scheibe: 11"},null,null,null,null,null,null,"1./2. od. 3./4. Platz",null,null,null,null,null,"Scheibe:"]
[null,1,2,"Summe","Punkte","Gesamt",null,null,null,null,null,null,null,null,1,2,"Summe","Punkte","Gesamt"]
[1,null,null,null,null,null,null,null,null,"Stechen",null,null,null,1,null,null,null,null,null,null,null,null,"Stechen"]
[null,null,null,null,null,null,null,null,1,null,null,null,null,null,null,null,null,null,null,null,null,1]
[null,null,null,null,null,null,null,null,2,null,null,null,null,null,null,null,null,null,null,null,null,2]
[2,null,null,null,null,null,null,null,3,null,null,null,null,2,null,null,null,null,null,null,null,3]
[]
[]
[3,null,null,null,null,null,null,null,"Punkte",null,null,null,null,3,null,null,null,null,null,null,null,"Punkte"]
[]
[null,null,null,null,null,null,null,null,"Gesamt",null,null,null,null,null,null,null,null,null,null,null,null,"Gesamt"]
["wenn erforderlich",null,null,null,null,null,null,null,null,null,null,null,null,"wenn erforderlich"]
[4,null,null,null,null,null,null,null,null,null,null,null,null,4]
[null,null,null,null,null,null,null,null,null,"gewonnen",null,null,null,null,null,null,null,null,null,null,null,null,"gewonnen"]
[null,null,null,null,null,null,null,null,null,"verloren",null,null,null,null,null,null,null,null,null,null,null,null,"verloren"]
[null,"Schreiber:",null,null,null,null,null,"Kontrolle:",null,null,null,null,null,null,"Schreiber:",null,null,null,null,null,"Kontrolle:"]
[]
[]
[]
[{"$f":"Select!$C$12","v":"ÖM Indoor 2019"},null,null,null,null,null,null,null,null,null,null,null,null,"Mannschaft:",null,null,{"$f":"MR16_Baum!$C$11","v":"RM_8"}]
["Veranstaltung"]
[{"$f":"Select!$C$13","v":"09.-10. Februar 2019"},null,null,null,null,null,null,null,null,null,null,null,null,"Schützen:",null,null,{"$f":"MR16_Baum!$C$12","v":"Schütze1_RM8 Schütze2_RM8"}]
["Datum"]
["Bewerb:",null,{"$f":"Select!$C$14","v":"Mannschaftsbewerb"},null,null,null,null,null,null,null,null,null,null,"Bogenklasse:",null,null,{"$f":"Select!$C$18","v":"Instinktivbogen Herren"}]
[]
[]
["1/8 Elimination",null,null,null,null,null,{"$f":"MR16_Baum!$C$58","v":"Scheibe: 34"},null,null,null,null,null,null,"1/4 Finale",null,null,null,null,null,{"$f":"MR16_Baum!$G$56","v":"Scheibe: 22"}]
[null,1,2,"Summe","Punkte","Gesamt",null,null,null,null,null,null,null,null,1,2,"Summe","Punkte","Gesamt"]
[1,null,null,null,null,null,null,null,null,"Stechen",null,null,null,1,null,null,null,null,null,null,null,null,"Stechen"]
[null,null,null,null,null,null,null,null,1,null,null,null,null,null,null,null,null,null,null,null,null,1]
[null,null,null,null,null,null,null,null,2,null,null,null,null,null,null,null,null,null,null,null,null,2]
[2,null,null,null,null,null,null,null,3,null,null,null,null,2,null,null,null,null,null,null,null,3]
[]
[]
[3,null,null,null,null,null,null,null,"Punkte",null,null,null,null,3,null,null,null,null,null,null,null,"Punkte"]
[]
[null,null,null,null,null,null,null,null,"Gesamt",null,null,null,null,null,null,null,null,null,null,null,null,"Gesamt"]
["wenn erforderlich",null,null,null,null,null,null,null,null,null,null,null,null,"wenn erforderlich"]
[4,null,null,null,null,null,null,null,null,null,null,null,null,4]
[null,null,null,null,null,null,null,null,null,"gewonnen",null,null,null,null,null,null,null,null,null,null,null,null,"gewonnen"]
[null,null,null,null,null,null,null,null,null,"verloren",null,null,null,null,null,null,null,null,null,null,null,null,"verloren"]
[null,"Schreiber:",null,null,null,null,null,"Kontrolle:",null,null,null,null,null,null,"Schreiber:",null,null,null,null,null,"Kontrolle:"]
[]
[]
["1/2 Finale",null,null,null,null,null,{"$f":"MR16_Baum!$K$55","v":"Scheibe: 11"},null,null,null,null,null,null,"1./2. od. 3./4. Platz",null,null,null,null,null,"Scheibe:"]
[null,1,2,"Summe","Punkte","Gesamt",null,null,null,null,null,null,null,null,1,2,"Summe","Punkte","Gesamt"]
[1,null,null,null,null,null,null,null,null,"Stechen",null,null,null,1,null,null,null,null,null,null,null,null,"Stechen"]
[null,null,null,null,null,null,null,null,1,null,null,null,null,null,null,null,null,null,null,null,null,1]
[null,null,null,null,null,null,null,null,2,null,null,null,null,null,null,null,null,null,null,null,null,2]
[2,null,null,null,null,null,null,null,3,null,null,null,null,2,null,null,null,null,null,null,null,3]
[]
[]
[3,null,null,null,null,null,null,null,"Punkte",null,null,null,null,3,null,null,null,null,null,null,null,"Punkte"]
[]
[null,null,null,null,null,null,null,null,"Gesamt",null,null,null,null,null,null,null,null,null,null,null,null,"Gesamt"]
["wenn erforderlich",null,null,null,null,null,null,null,null,null,null,null,null,"wenn erforderlich"]
[4,null,null,null,null,null,null,null,null,null,null,null,null,4]
[null,null,null,null,null,null,null,null,null,"gewonnen",null,null,null,null,null,null,null,null,null,null,null,null,"gewonnen"]
[null,null,null,null,null,null,null,null,null,"verloren",null,null,null,null,null,null,null,null,null,null,null,null,"verloren"]
[null,"Schreiber:",null,null,null,null,null,"Kontrolle:",null,null,null,null,null,null,"Schreiber:",null,null,null,null,null,"Kontrolle:"]
[]
[]
[]
[{"$f":"Select!$C$12","v":"ÖM Indoor 2019"},null,null,null,null,null,null,null,null,null,null,null,null,"Mannschaft:",null,null,{"$f":"MR16_Baum!$C$15","v":"RM_5"}]
["Veranstaltung"]
[{"$f":"Select!$C$13","v":"09.-10. Februar 2019"},null,null,null,null,null,null,null,null,null,null,null,null,"Schützen:",null,null,{"$f":"MR16_Baum!$C$16","v":"Schütze1_RM5 Schütze2_RM5"}]
["Datum"]
["Bewerb:",null,{"$f":"Select!$C$14","v":"Mannschaftsbewerb"},null,null,null,null,null,null,null,null,null,null,"Bogenklasse:",null,null,{"$f":"Select!$C$18","v":"Instinktivbogen Herren"}]
[]
[]
["1/8 Elimination",null,null,null,null,null,{"$f":"MR16_Baum!$C$59","v":"Scheibe: 35"},null,null,null,null,null,null,"1/4 Finale",null,null,null,null,null,{"$f":"MR16_Baum!$G$57","v":"Scheibe: 23"}]
[null,1,2,"Summe","Punkte","Gesamt",null,null,null,null,null,null,null,null,1,2,"Summe","Punkte","Gesamt"]
[1,null,null,null,null,null,null,null,null,"Stechen",null,null,null,1,null,null,null,null,null,null,null,null,"Stechen"]
[null,null,null,null,null,null,null,null,1,null,null,null,null,null,null,null,null,null,null,null,null,1]
[null,null,null,null,null,null,null,null,2,null,null,null,null,null,null,null,null,null,null,null,null,2]
[2,null,null,null,null,null,null,null,3,null,null,null,null,2,null,null,null,null,null,null,null,3]
[]
[]
[3,null,null,null,null,null,null,null,"Punkte",null,null,null,null,3,null,null,null,null,null,null,null,"Punkte"]
[]
[null,null,null,null,null,null,null,null,"Gesamt",null,null,null,null,null,null,null,null,null,null,null,null,"Gesamt"]
["wenn erforderlich",null,null,null,null,null,null,null,null,null,null,null,null,"wenn erforderlich"]
[4,null,null,null,null,null,null,null,null,null,null,null,null,4]
[null,null,null,null,null,null,null,null,null,"gewonnen",null,null,null,null,null,null,null,null,null,null,null,null,"gewonnen"]
[null,null,null,null,null,null,null,null,null,"verloren",null,null,null,null,null,null,null,null,null,null,null,null,"verloren"]
[null,"Schreiber:",null,null,null,null,null,"Kontrolle:",null,null,null,null,null,null,"Schreiber:",null,null,null,null,null,"Kontrolle:"]
[]
[]
["1/2 Finale",null,null,null,null,null,{"$f":"MR16_Baum!$K$56","v":"Scheibe: 12"},null,null,null,null,null,null,"1./2. od. 3./4. Platz",null,null,null,null,null,"Scheibe:"]
[null,1,2,"Summe","Punkte","Gesamt",null,null,null,null,null,null,null,null,1,2,"Summe","Punkte","Gesamt"]
[1,null,null,null,null,null,null,null,null,"Stechen",null,null,null,1,null,null,null,null,null,null,null,null,"Stechen"]
[null,null,null,null,null,null,null,null,1,null,null,null,null,null,null,null,null,null,null,null,null,1]
[null,null,null,null,null,null,null,null,2,null,null,null,null,null,null,null,null,null,null,null,null,2]
[2,null,null,null,null,null,null,null,3,null,null,null,null,2,null,null,null,null,null,null,null,3]
[]
[]
[3,null,null,null,null,null,null,null,"Punkte",null,null,null,null,3,null,null,null,null,null,null,null,"Punkte"]
[]
[null,null,null,null,null,null,null,null,"Gesamt",null,null,null,null,null,null,null,null,null,null,null,null,"Gesamt"]
["wenn erforderlich",null,null,null,null,null,null,null,null,null,null,null,null,"wenn erforderlich"]
[4,null,null,null,null,null,null,null,null,null,null,null,null,4]
[null,null,null,null,null,null,null,null,null,"gewonnen",null,null,null,null,null,null,null,null,null,null,null,null,"gewonnen"]
[null,null,null,null,null,null,null,null,null,"verloren",null,null,null,null,null,null,null,null,null,null,null,null,"verloren"]
[null,"Schreiber:",null,null,null,null,null,"Kontrolle:",null,null,null,null,null,null,"Schreiber:",null,null,null,null,null,"Kontrolle:"]
[]
[]
[]
[{"$f":"Select!$C$12","v":"ÖM Indoor 2019"},null,null,null,null,null,null,null,null,null,null,null,null,"Mannschaft:",null,null,{"$f":"MR16_Baum!$C$17","v":"RM_12"}]
["Veranstaltung"]
[{"$f":"Select!$C$13","v":"09.-10. Februar 2019"},null,null,null,null,null,null,null,null,null,null,null,null,"Schützen:",null,null,{"$f":"MR16_Baum!$C$18","v":"Schütze1_RM12  Schütze2_RM12"}]
["Datum"]
["Bewerb:",null,{"$f":"Select!$C$14","v":"Mannschaftsbewerb"},null,null,null,null,null,null,null,null,null,null,"Bogenklasse:",null,null,{"$f":"Select!$C$18","v":"Instinktivbogen Herren"}]
[]
[]
["1/8 Elimination",null,null,null,null,null,{"$f":"MR16_Baum!$C$60","v":"Scheibe: 36"},null,null,null,null,null,null,"1/4 Finale",null,null,null,null,null,{"$f":"MR16_Baum!$G$57","v":"Scheibe: 23"}]
[null,1,2,"Summe","Punkte","Gesamt",null,null,null,null,null,null,null,null,1,2,"Summe","Punkte","Gesamt"]
[1,null,null,null,null,null,null,null,null,"Stechen",null,null,null,1,null,null,null,null,null,null,null,null,"Stechen"]
[null,null,null,null,null,null,null,null,1,null,null,null,null,null,null,null,null,null,null,null,null,1]
[null,null,null,null,null,null,null,null,2,null,null,null,null,null,null,null,null,null,null,null,null,2]
[2,null,null,null,null,null,null,null,3,null,null,null,null,2,null,null,null,null,null,null,null,3]
[]
[]
[3,null,null,null,null,null,null,null,"Punkte",null,null,null,null,3,null,null,null,null,null,null,null,"Punkte"]
[]
[null,null,null,null,null,null,null,null,"Gesamt",null,null,null,null,null,null,null,null,null,null,null,null,"Gesamt"]
["wenn erforderlich",null,null,null,null,null,null,null,null,null,null,null,null,"wenn erforderlich"]
[4,null,null,null,null,null,null,null,null,null,null,null,null,4]
[null,null,null,null,null,null,null,null,null,"gewonnen",null,null,null,null,null,null,null,null,null,null,null,null,"gewonnen"]
[null,null,null,null,null,null,null,null,null,"verloren",null,null,null,null,null,null,null,null,null,null,null,null,"verloren"]
[null,"Schreiber:",null,null,null,null,null,"Kontrolle:",null,null,null,null,null,null,"Schreiber:",null,null,null,null,null,"Kontrolle:"]
[]
[]
["1/2 Finale",null,null,null,null,null,{"$f":"MR16_Baum!$K$56","v":"Scheibe: 12"},null,null,null,null,null,null,"1./2. od. 3./4. Platz",null,null,null,null,null,"Scheibe:"]
[null,1,2,"Summe","Punkte","Gesamt",null,null,null,null,null,null,null,null,1,2,"Summe","Punkte","Gesamt"]
[1,null,null,null,null,null,null,null,null,"Stechen",null,null,null,1,null,null,null,null,null,null,null,null,"Stechen"]
[null,null,null,null,null,null,null,null,1,null,null,null,null,null,null,null,null,null,null,null,null,1]
[null,null,null,null,null,null,null,null,2,null,null,null,null,null,null,null,null,null,null,null,null,2]
[2,null,null,null,null,null,null,null,3,null,null,null,null,2,null,null,null,null,null,null,null,3]
[]
[]
[3,null,null,null,null,null,null,null,"Punkte",null,null,null,null,3,null,null,null,null,null,null,null,"Punkte"]
[]
[null,null,null,null,null,null,null,null,"Gesamt",null,null,null,null,null,null,null,null,null,null,null,null,"Gesamt"]
["wenn erforderlich",null,null,null,null,null,null,null,null,null,null,null,null,"wenn erforderlich"]
[4,null,null,null,null,null,null,null,null,null,null,null,null,4]
[null,null,null,null,null,null,null,null,null,"gewonnen",null,null,null,null,null,null,null,null,null,null,null,null,"gewonnen"]
[null,null,null,null,null,null,null,null,null,"verloren",null,null,null,null,null,null,null,null,null,null,null,null,"verloren"]
[null,"Schreiber:",null,null,null,null,null,"Kontrolle:",null,null,null,null,null,null,"Schreiber:",null,null,null,null,null,"Kontrolle:"]
[]
[]
[]
[{"$f":"Select!$C$12","v":"ÖM Indoor 2019"},null,null,null,null,null,null,null,null,null,null,null,null,"Mannschaft:",null,null,{"$f":"MR16_Baum!$C$21","v":"RM_13"}]
["Veranstaltung"]
[{"$f":"Select!$C$13","v":"09.-10. Februar 2019"},null,null,null,null,null,null,null,null,null,null,null,null,"Schützen:",null,null,{"$f":"MR16_Baum!$C$22","v":"Schütze1_RM13  Schütze2_RM13 "}]
["Datum"]
["Bewerb:",null,{"$f":"Select!$C$14","v":"Mannschaftsbewerb"},null,null,null,null,null,null,null,null,null,null,"Bogenklasse:",null,null,{"$f":"Select!$C$18","v":"Instinktivbogen Herren"}]
[]
[]
["1/8 Elimination",null,null,null,null,null,{"$f":"MR16_Baum!$C$61","v":"Scheibe: 37"},null,null,null,null,null,null,"1/4 Finale",null,null,null,null,null,{"$f":"MR16_Baum!$G$58","v":"Scheibe: 24"}]
[null,1,2,"Summe","Punkte","Gesamt",null,null,null,null,null,null,null,null,1,2,"Summe","Punkte","Gesamt"]
[1,null,null,null,null,null,null,null,null,"Stechen",null,null,null,1,null,null,null,null,null,null,null,null,"Stechen"]
[null,null,null,null,null,null,null,null,1,null,null,null,null,null,null,null,null,null,null,null,null,1]
[null,null,null,null,null,null,null,null,2,null,null,null,null,null,null,null,null,null,null,null,null,2]
[2,null,null,null,null,null,null,null,3,null,null,null,null,2,null,null,null,null,null,null,null,3]
[]
[]
[3,null,null,null,null,null,null,null,"Punkte",null,null,null,null,3,null,null,null,null,null,null,null,"Punkte"]
[]
[null,null,null,null,null,null,null,null,"Gesamt",null,null,null,null,null,null,null,null,null,null,null,null,"Gesamt"]
["wenn erforderlich",null,null,null,null,null,null,null,null,null,null,null,null,"wenn erforderlich"]
[4,null,null,null,null,null,null,null,null,null,null,null,null,4]
[null,null,null,null,null,null,null,null,null,"gewonnen",null,null,null,null,null,null,null,null,null,null,null,null,"gewonnen"]
[null,null,null,null,null,null,null,null,null,"verloren",null,null,null,null,null,null,null,null,null,null,null,null,"verloren"]
[null,"Schreiber:",null,null,null,null,null,"Kontrolle:",null,null,null,null,null,null,"Schreiber:",null,null,null,null,null,"Kontrolle:"]
[]
[]
["1/2 Finale",null,null,null,null,null,{"$f":"MR16_Baum!$K$56","v":"Scheibe: 12"},null,null,null,null,null,null,"1./2. od. 3./4. Platz",null,null,null,null,null,"Scheibe:"]
[null,1,2,"Summe","Punkte","Gesamt",null,null,null,null,null,null,null,null,1,2,"Summe","Punkte","Gesamt"]
[1,null,null,null,null,null,null,null,null,"Stechen",null,null,null,1,null,null,null,null,null,null,null,null,"Stechen"]
[null,null,null,null,null,null,null,null,1,null,null,null,null,null,null,null,null,null,null,null,null,1]
[null,null,null,null,null,null,null,null,2,null,null,null,null,null,null,null,null,null,null,null,null,2]
[2,null,null,null,null,null,null,null,3,null,null,null,null,2,null,null,null,null,null,null,null,3]
[]
[]
[3,null,null,null,null,null,null,null,"Punkte",null,null,null,null,3,null,null,null,null,null,null,null,"Punkte"]
[]
[null,null,null,null,null,null,null,null,"Gesamt",null,null,null,null,null,null,null,null,null,null,null,null,"Gesamt"]
["wenn erforderlich",null,null,null,null,null,null,null,null,null,null,null,null,"wenn erforderlich"]
[4,null,null,null,null,null,null,null,null,null,null,null,null,4]
[null,null,null,null,null,null,null,null,null,"gewonnen",null,null,null,null,null,null,null,null,null,null,null,null,"gewonnen"]
[null,null,null,null,null,null,null,null,null,"verloren",null,null,null,null,null,null,null,null,null,null,null,null,"verloren"]
[null,"Schreiber:",null,null,null,null,null,"Kontrolle:",null,null,null,null,null,null,"Schreiber:",null,null,null,null,null,"Kontrolle:"]
[]
[]
[]
[{"$f":"Select!$C$12","v":"ÖM Indoor 2019"},null,null,null,null,null,null,null,null,null,null,null,null,"Mannschaft:",null,null,{"$f":"MR16_Baum!$C$23","v":"RM_4"}]
["Veranstaltung"]
[{"$f":"Select!$C$13","v":"09.-10. Februar 2019"},null,null,null,null,null,null,null,null,null,null,null,null,"Schützen:",null,null,{"$f":"MR16_Baum!$C$24","v":"Schütze1_RM4 Schütze2_RM4"}]
["Datum"]
["Bewerb:",null,{"$f":"Select!$C$14","v":"Mannschaftsbewerb"},null,null,null,null,null,null,null,null,null,null,"Bogenklasse:",null,null,{"$f":"Select!$C$18","v":"Instinktivbogen Herren"}]
[]
[]
["1/8 Elimination",null,null,null,null,null,{"$f":"MR16_Baum!$C$62","v":"Scheibe: 38"},null,null,null,null,null,null,"1/4 Finale",null,null,null,null,null,{"$f":"MR16_Baum!$G$58","v":"Scheibe: 24"}]
[null,1,2,"Summe","Punkte","Gesamt",null,null,null,null,null,null,null,null,1,2,"Summe","Punkte","Gesamt"]
[1,null,null,null,null,null,null,null,null,"Stechen",null,null,null,1,null,null,null,null,null,null,null,null,"Stechen"]
[null,null,null,null,null,null,null,null,1,null,null,null,null,null,null,null,null,null,null,null,null,1]
[null,null,null,null,null,null,null,null,2,null,null,null,null,null,null,null,null,null,null,null,null,2]
[2,null,null,null,null,null,null,null,3,null,null,null,null,2,null,null,null,null,null,null,null,3]
[]
[]
[3,null,null,null,null,null,null,null,"Punkte",null,null,null,null,3,null,null,null,null,null,null,null,"Punkte"]
[]
[null,null,null,null,null,null,null,null,"Gesamt",null,null,null,null,null,null,null,null,null,null,null,null,"Gesamt"]
["wenn erforderlich",null,null,null,null,null,null,null,null,null,null,null,null,"wenn erforderlich"]
[4,null,null,null,null,null,null,null,null,null,null,null,null,4]
[null,null,null,null,null,null,null,null,null,"gewonnen",null,null,null,null,null,null,null,null,null,null,null,null,"gewonnen"]
[null,null,null,null,null,null,null,null,null,"verloren",null,null,null,null,null,null,null,null,null,null,null,null,"verloren"]
[null,"Schreiber:",null,null,null,null,null,"Kontrolle:",null,null,null,null,null,null,"Schreiber:",null,null,null,null,null,"Kontrolle:"]
[]
[]
["1/2 Finale",null,null,null,null,null,{"$f":"MR16_Baum!$K$56","v":"Scheibe: 12"},null,null,null,null,null,null,"1./2. od. 3./4. Platz",null,null,null,null,null,"Scheibe:"]
[null,1,2,"Summe","Punkte","Gesamt",null,null,null,null,null,null,null,null,1,2,"Summe","Punkte","Gesamt"]
[1,null,null,null,null,null,null,null,null,"Stechen",null,null,null,1,null,null,null,null,null,null,null,null,"Stechen"]
[null,null,null,null,null,null,null,null,1,null,null,null,null,null,null,null,null,null,null,null,null,1]
[null,null,null,null,null,null,null,null,2,null,null,null,null,null,null,null,null,null,null,null,null,2]
[2,null,null,null,null,null,null,null,3,null,null,null,null,2,null,null,null,null,null,null,null,3]
[]
[]
[3,null,null,null,null,null,null,null,"Punkte",null,null,null,null,3,null,null,null,null,null,null,null,"Punkte"]
[]
[null,null,null,null,null,null,null,null,"Gesamt",null,null,null,null,null,null,null,null,null,null,null,null,"Gesamt"]
["wenn erforderlich",null,null,null,null,null,null,null,null,null,null,null,null,"wenn erforderlich"]
[4,null,null,null,null,null,null,null,null,null,null,null,null,4]
[null,null,null,null,null,null,null,null,null,"gewonnen",null,null,null,null,null,null,null,null,null,null,null,null,"gewonnen"]
[null,null,null,null,null,null,null,null,null,"verloren",null,null,null,null,null,null,null,null,null,null,null,null,"verloren"]
[null,"Schreiber:",null,null,null,null,null,"Kontrolle:",null,null,null,null,null,null,"Schreiber:",null,null,null,null,null,"Kontrolle:"]
[]
[]
[]
[{"$f":"Select!$C$12","v":"ÖM Indoor 2019"},null,null,null,null,null,null,null,null,null,null,null,null,"Mannschaft:",null,null,{"$f":"MR16_Baum!$C$27","v":"RM_3"}]
["Veranstaltung"]
[{"$f":"Select!$C$13","v":"09.-10. Februar 2019"},null,null,null,null,null,null,null,null,null,null,null,null,"Schützen:",null,null,{"$f":"MR16_Baum!$C$28","v":"Schütze1_RM3 Schütze2_RM3"}]
["Datum"]
["Bewerb:",null,{"$f":"Select!$C$14","v":"Mannschaftsbewerb"},null,null,null,null,null,null,null,null,null,null,"Bogenklasse:",null,null,{"$f":"Select!$C$18","v":"Instinktivbogen Herren"}]
[]
[]
["1/8 Elimination",null,null,null,null,null,{"$f":"MR16_Baum!$C$63","v":"Scheibe: 39"},null,null,null,null,null,null,"1/4 Finale",null,null,null,null,null,{"$f":"MR16_Baum!$G$59","v":"Scheibe: 25"}]
[null,1,2,"Summe","Punkte","Gesamt",null,null,null,null,null,null,null,null,1,2,"Summe","Punkte","Gesamt"]
[1,null,null,null,null,null,null,null,null,"Stechen",null,null,null,1,null,null,null,null,null,null,null,null,"Stechen"]
[null,null,null,null,null,null,null,null,1,null,null,null,null,null,null,null,null,null,null,null,null,1]
[null,null,null,null,null,null,null,null,2,null,null,null,null,null,null,null,null,null,null,null,null,2]
[2,null,null,null,null,null,null,null,3,null,null,null,null,2,null,null,null,null,null,null,null,3]
[]
[]
[3,null,null,null,null,null,null,null,"Punkte",null,null,null,null,3,null,null,null,null,null,null,null,"Punkte"]
[]
[null,null,null,null,null,null,null,null,"Gesamt",null,null,null,null,null,null,null,null,null,null,null,null,"Gesamt"]
["wenn erforderlich",null,null,null,null,null,null,null,null,null,null,null,null,"wenn erforderlich"]
[4,null,null,null,null,null,null,null,null,null,null,null,null,4]
[null,null,null,null,null,null,null,null,null,"gewonnen",null,null,null,null,null,null,null,null,null,null,null,null,"gewonnen"]
[null,null,null,null,null,null,null,null,null,"verloren",null,null,null,null,null,null,null,null,null,null,null,null,"verloren"]
[null,"Schreiber:",null,null,null,null,null,"Kontrolle:",null,null,null,null,null,null,"Schreiber:",null,null,null,null,null,"Kontrolle:"]
[]
[]
["1/2 Finale",null,null,null,null,null,{"$f":"MR16_Baum!$K$57","v":"Scheibe: 13"},null,null,null,null,null,null,"1./2. od. 3./4. Platz",null,null,null,null,null,"Scheibe:"]
[null,1,2,"Summe","Punkte","Gesamt",null,null,null,null,null,null,null,null,1,2,"Summe","Punkte","Gesamt"]
[1,null,null,null,null,null,null,null,null,"Stechen",null,null,null,1,null,null,null,null,null,null,null,null,"Stechen"]
[null,null,null,null,null,null,null,null,1,null,null,null,null,null,null,null,null,null,null,null,null,1]
[null,null,null,null,null,null,null,null,2,null,null,null,null,null,null,null,null,null,null,null,null,2]
[2,null,null,null,null,null,null,null,3,null,null,null,null,2,null,null,null,null,null,null,null,3]
[]
[]
[3,null,null,null,null,null,null,null,"Punkte",null,null,null,null,3,null,null,null,null,null,null,null,"Punkte"]
[]
[null,null,null,null,null,null,null,null,"Gesamt",null,null,null,null,null,null,null,null,null,null,null,null,"Gesamt"]
["wenn erforderlich",null,null,null,null,null,null,null,null,null,null,null,null,"wenn erforderlich"]
[4,null,null,null,null,null,null,null,null,null,null,null,null,4]
[null,null,null,null,null,null,null,null,null,"gewonnen",null,null,null,null,null,null,null,null,null,null,null,null,"gewonnen"]
[null,null,null,null,null,null,null,null,null,"verloren",null,null,null,null,null,null,null,null,null,null,null,null,"verloren"]
[null,"Schreiber:",null,null,null,null,null,"Kontrolle:",null,null,null,null,null,null,"Schreiber:",null,null,null,null,null,"Kontrolle:"]
[]
[]
[]
[{"$f":"Select!$C$12","v":"ÖM Indoor 2019"},null,null,null,null,null,null,null,null,null,null,null,null,"Mannschaft:",null,null,{"$f":"MR16_Baum!$C$29","v":"RM_14"}]
["Veranstaltung"]
[{"$f":"Select!$C$13","v":"09.-10. Februar 2019"},null,null,null,null,null,null,null,null,null,null,null,null,"Schützen:",null,null,{"$f":"MR16_Baum!$C$30","v":"Schütze1_RM14 Schütze2_RM14 "}]
["Datum"]
["Bewerb:",null,{"$f":"Select!$C$14","v":"Mannschaftsbewerb"},null,null,null,null,null,null,null,null,null,null,"Bogenklasse:",null,null,{"$f":"Select!$C$18","v":"Instinktivbogen Herren"}]
[]
[]
["1/8 Elimination",null,null,null,null,null,{"$f":"MR16_Baum!$C$64","v":"Scheibe: 40"},null,null,null,null,null,null,"1/4 Finale",null,null,null,null,null,{"$f":"MR16_Baum!$G$59","v":"Scheibe: 25"}]
[null,1,2,"Summe","Punkte","Gesamt",null,null,null,null,null,null,null,null,1,2,"Summe","Punkte","Gesamt"]
[1,null,null,null,null,null,null,null,null,"Stechen",null,null,null,1,null,null,null,null,null,null,null,null,"Stechen"]
[null,null,null,null,null,null,null,null,1,null,null,null,null,null,null,null,null,null,null,null,null,1]
[null,null,null,null,null,null,null,null,2,null,null,null,null,null,null,null,null,null,null,null,null,2]
[2,null,null,null,null,null,null,null,3,null,null,null,null,2,null,null,null,null,null,null,null,3]
[]
[]
[3,null,null,null,null,null,null,null,"Punkte",null,null,null,null,3,null,null,null,null,null,null,null,"Punkte"]
[]
[null,null,null,null,null,null,null,null,"Gesamt",null,null,null,null,null,null,null,null,null,null,null,null,"Gesamt"]
["wenn erforderlich",null,null,null,null,null,null,null,null,null,null,null,null,"wenn erforderlich"]
[4,null,null,null,null,null,null,null,null,null,null,null,null,4]
[null,null,null,null,null,null,null,null,null,"gewonnen",null,null,null,null,null,null,null,null,null,null,null,null,"gewonnen"]
[null,null,null,null,null,null,null,null,null,"verloren",null,null,null,null,null,null,null,null,null,null,null,null,"verloren"]
[null,"Schreiber:",null,null,null,null,null,"Kontrolle:",null,null,null,null,null,null,"Schreiber:",null,null,null,null,null,"Kontrolle:"]
[]
[]
["1/2 Finale",null,null,null,null,null,{"$f":"MR16_Baum!$K$57","v":"Scheibe: 13"},null,null,null,null,null,null,"1./2. od. 3./4. Platz",null,null,null,null,null,"Scheibe:"]
[null,1,2,"Summe","Punkte","Gesamt",null,null,null,null,null,null,null,null,1,2,"Summe","Punkte","Gesamt"]
[1,null,null,null,null,null,null,null,null,"Stechen",null,null,null,1,null,null,null,null,null,null,null,null,"Stechen"]
[null,null,null,null,null,null,null,null,1,null,null,null,null,null,null,null,null,null,null,null,null,1]
[null,null,null,null,null,null,null,null,2,null,null,null,null,null,null,null,null,null,null,null,null,2]
[2,null,null,null,null,null,null,null,3,null,null,null,null,2,null,null,null,null,null,null,null,3]
[]
[]
[3,null,null,null,null,null,null,null,"Punkte",null,null,null,null,3,null,null,null,null,null,null,null,"Punkte"]
[]
[null,null,null,null,null,null,null,null,"Gesamt",null,null,null,null,null,null,null,null,null,null,null,null,"Gesamt"]
["wenn erforderlich",null,null,null,null,null,null,null,null,null,null,null,null,"wenn erforderlich"]
[4,null,null,null,null,null,null,null,null,null,null,null,null,4]
[null,null,null,null,null,null,null,null,null,"gewonnen",null,null,null,null,null,null,null,null,null,null,null,null,"gewonnen"]
[null,null,null,null,null,null,null,null,null,"verloren",null,null,null,null,null,null,null,null,null,null,null,null,"verloren"]
[null,"Schreiber:",null,null,null,null,null,"Kontrolle:",null,null,null,null,null,null,"Schreiber:",null,null,null,null,null,"Kontrolle:"]
[]
[]
[]
[{"$f":"Select!$C$12","v":"ÖM Indoor 2019"},null,null,null,null,null,null,null,null,null,null,null,null,"Mannschaft:",null,null,{"$f":"MR16_Baum!$C$33","v":"RM_11"}]
["Veranstaltung"]
[{"$f":"Select!$C$13","v":"09.-10. Februar 2019"},null,null,null,null,null,null,null,null,null,null,null,null,"Schützen:",null,null,{"$f":"MR16_Baum!$C$34","v":"Schütze1_RM11 Schütze2_RM11"}]
["Datum"]
["Bewerb:",null,{"$f":"Select!$C$14","v":"Mannschaftsbewerb"},null,null,null,null,null,null,null,null,null,null,"Bogenklasse:",null,null,{"$f":"Select!$C$18","v":"Instinktivbogen Herren"}]
[]
[]
["1/8 Elimination",null,null,null,null,null,{"$f":"MR16_Baum!$C$65","v":"Scheibe: 41"},null,null,null,null,null,null,"1/4 Finale",null,null,null,null,null,{"$f":"MR16_Baum!$G$60","v":"Scheibe: 26"}]
[null,1,2,"Summe","Punkte","Gesamt",null,null,null,null,null,null,null,null,1,2,"Summe","Punkte","Gesamt"]
[1,null,null,null,null,null,null,null,null,"Stechen",null,null,null,1,null,null,null,null,null,null,null,null,"Stechen"]
[null,null,null,null,null,null,null,null,1,null,null,null,null,null,null,null,null,null,null,null,null,1]
[null,null,null,null,null,null,null,null,2,null,null,null,null,null,null,null,null,null,null,null,null,2]
[2,null,null,null,null,null,null,null,3,null,null,null,null,2,null,null,null,null,null,null,null,3]
[]
[]
[3,null,null,null,null,null,null,null,"Punkte",null,null,null,null,3,null,null,null,null,null,null,null,"Punkte"]
[]
[null,null,null,null,null,null,null,null,"Gesamt",null,null,null,null,null,null,null,null,null,null,null,null,"Gesamt"]
["wenn erforderlich",null,null,null,null,null,null,null,null,null,null,null,null,"wenn erforderlich"]
[4,null,null,null,null,null,null,null,null,null,null,null,null,4]
[null,null,null,null,null,null,null,null,null,"gewonnen",null,null,null,null,null,null,null,null,null,null,null,null,"gewonnen"]
[null,null,null,null,null,null,null,null,null,"verloren",null,null,null,null,null,null,null,null,null,null,null,null,"verloren"]
[null,"Schreiber:",null,null,null,null,null,"Kontrolle:",null,null,null,null,null,null,"Schreiber:",null,null,null,null,null,"Kontrolle:"]
[]
[]
["1/2 Finale",null,null,null,null,null,{"$f":"MR16_Baum!$K$57","v":"Scheibe: 13"},null,null,null,null,null,null,"1./2. od. 3./4. Platz",null,null,null,null,null,"Scheibe:"]
[null,1,2,"Summe","Punkte","Gesamt",null,null,null,null,null,null,null,null,1,2,"Summe","Punkte","Gesamt"]
[1,null,null,null,null,null,null,null,null,"Stechen",null,null,null,1,null,null,null,null,null,null,null,null,"Stechen"]
[null,null,null,null,null,null,null,null,1,null,null,null,null,null,null,null,null,null,null,null,null,1]
[null,null,null,null,null,null,null,null,2,null,null,null,null,null,null,null,null,null,null,null,null,2]
[2,null,null,null,null,null,null,null,3,null,null,null,null,2,null,null,null,null,null,null,null,3]
[]
[]
[3,null,null,null,null,null,null,null,"Punkte",null,null,null,null,3,null,null,null,null,null,null,null,"Punkte"]
[]
[null,null,null,null,null,null,null,null,"Gesamt",null,null,null,null,null,null,null,null,null,null,null,null,"Gesamt"]
["wenn erforderlich",null,null,null,null,null,null,null,null,null,null,null,null,"wenn erforderlich"]
[4,null,null,null,null,null,null,null,null,null,null,null,null,4]
[null,null,null,null,null,null,null,null,null,"gewonnen",null,null,null,null,null,null,null,null,null,null,null,null,"gewonnen"]
[null,null,null,null,null,null,null,null,null,"verloren",null,null,null,null,null,null,null,null,null,null,null,null,"verloren"]
[null,"Schreiber:",null,null,null,null,null,"Kontrolle:",null,null,null,null,null,null,"Schreiber:",null,null,null,null,null,"Kontrolle:"]
[]
[]
[]
[{"$f":"Select!$C$12","v":"ÖM Indoor 2019"},null,null,null,null,null,null,null,null,null,null,null,null,"Mannschaft:",null,null,{"$f":"MR16_Baum!$C$35","v":"RM_6"}]
["Veranstaltung"]
[{"$f":"Select!$C$13","v":"09.-10. Februar 2019"},null,null,null,null,null,null,null,null,null,null,null,null,"Schützen:",null,null,{"$f":"MR16_Baum!$C$36","v":"Schütze1_RM6 Schütze2_RM6"}]
["Datum"]
["Bewerb:",null,{"$f":"Select!$C$14","v":"Mannschaftsbewerb"},null,null,null,null,null,null,null,null,null,null,"Bogenklasse:",null,null,{"$f":"Select!$C$18","v":"Instinktivbogen Herren"}]
[]
[]
["1/8 Elimination",null,null,null,null,null,{"$f":"MR16_Baum!$C$66","v":"Scheibe: 42"},null,null,null,null,null,null,"1/4 Finale",null,null,null,null,null,{"$f":"MR16_Baum!$G$60","v":"Scheibe: 26"}]
[null,1,2,"Summe","Punkte","Gesamt",null,null,null,null,null,null,null,null,1,2,"Summe","Punkte","Gesamt"]
[1,null,null,null,null,null,null,null,null,"Stechen",null,null,null,1,null,null,null,null,null,null,null,null,"Stechen"]
[null,null,null,null,null,null,null,null,1,null,null,null,null,null,null,null,null,null,null,null,null,1]
[null,null,null,null,null,null,null,null,2,null,null,null,null,null,null,null,null,null,null,null,null,2]
[2,null,null,null,null,null,null,null,3,null,null,null,null,2,null,null,null,null,null,null,null,3]
[]
[]
[3,null,null,null,null,null,null,null,"Punkte",null,null,null,null,3,null,null,null,null,null,null,null,"Punkte"]
[]
[null,null,null,null,null,null,null,null,"Gesamt",null,null,null,null,null,null,null,null,null,null,null,null,"Gesamt"]
["wenn erforderlich",null,null,null,null,null,null,null,null,null,null,null,null,"wenn erforderlich"]
[4,null,null,null,null,null,null,null,null,null,null,null,null,4]
[null,null,null,null,null,null,null,null,null,"gewonnen",null,null,null,null,null,null,null,null,null,null,null,null,"gewonnen"]
[null,null,null,null,null,null,null,null,null,"verloren",null,null,null,null,null,null,null,null,null,null,null,null,"verloren"]
[null,"Schreiber:",null,null,null,null,null,"Kontrolle:",null,null,null,null,null,null,"Schreiber:",null,null,null,null,null,"Kontrolle:"]
[]
[]
["1/2 Finale",null,null,null,null,null,{"$f":"MR16_Baum!$K$57","v":"Scheibe: 13"},null,null,null,null,null,null,"1./2. od. 3./4. Platz",null,null,null,null,null,"Scheibe:"]
[null,1,2,"Summe","Punkte","Gesamt",null,null,null,null,null,null,null,null,1,2,"Summe","Punkte","Gesamt"]
[1,null,null,null,null,null,null,null,null,"Stechen",null,null,null,1,null,null,null,null,null,null,null,null,"Stechen"]
[null,null,null,null,null,null,null,null,1,null,null,null,null,null,null,null,null,null,null,null,null,1]
[null,null,null,null,null,null,null,null,2,null,null,null,null,null,null,null,null,null,null,null,null,2]
[2,null,null,null,null,null,null,null,3,null,null,null,null,2,null,null,null,null,null,null,null,3]
[]
[]
[3,null,null,null,null,null,null,null,"Punkte",null,null,null,null,3,null,null,null,null,null,null,null,"Punkte"]
[]
[null,null,null,null,null,null,null,null,"Gesamt",null,null,null,null,null,null,null,null,null,null,null,null,"Gesamt"]
["wenn erforderlich",null,null,null,null,null,null,null,null,null,null,null,null,"wenn erforderlich"]
[4,null,null,null,null,null,null,null,null,null,null,null,null,4]
[null,null,null,null,null,null,null,null,null,"gewonnen",null,null,null,null,null,null,null,null,null,null,null,null,"gewonnen"]
[null,null,null,null,null,null,null,null,null,"verloren",null,null,null,null,null,null,null,null,null,null,null,null,"verloren"]
[null,"Schreiber:",null,null,null,null,null,"Kontrolle:",null,null,null,null,null,null,"Schreiber:",null,null,null,null,null,"Kontrolle:"]
[]
[]
[]
[{"$f":"Select!$C$12","v":"ÖM Indoor 2019"},null,null,null,null,null,null,null,null,null,null,null,null,"Mannschaft:",null,null,{"$f":"MR16_Baum!$C$39","v":"RM_7"}]
["Veranstaltung"]
[{"$f":"Select!$C$13","v":"09.-10. Februar 2019"},null,null,null,null,null,null,null,null,null,null,null,null,"Schützen:",null,null,{"$f":"MR16_Baum!$C$40","v":"Schütze1_RM7 Schütze2_RM7"}]
["Datum"]
["Bewerb:",null,{"$f":"Select!$C$14","v":"Mannschaftsbewerb"},null,null,null,null,null,null,null,null,null,null,"Bogenklasse:",null,null,{"$f":"Select!$C$18","v":"Instinktivbogen Herren"}]
[]
[]
["1/8 Elimination",null,null,null,null,null,{"$f":"MR16_Baum!$C$67","v":"Scheibe: 43"},null,null,null,null,null,null,"1/4 Finale",null,null,null,null,null,{"$f":"MR16_Baum!$G$61","v":"Scheibe: 27"}]
[null,1,2,"Summe","Punkte","Gesamt",null,null,null,null,null,null,null,null,1,2,"Summe","Punkte","Gesamt"]
[1,null,null,null,null,null,null,null,null,"Stechen",null,null,null,1,null,null,null,null,null,null,null,null,"Stechen"]
[null,null,null,null,null,null,null,null,1,null,null,null,null,null,null,null,null,null,null,null,null,1]
[null,null,null,null,null,null,null,null,2,null,null,null,null,null,null,null,null,null,null,null,null,2]
[2,null,null,null,null,null,null,null,3,null,null,null,null,2,null,null,null,null,null,null,null,3]
[]
[]
[3,null,null,null,null,null,null,null,"Punkte",null,null,null,null,3,null,null,null,null,null,null,null,"Punkte"]
[]
[null,null,null,null,null,null,null,null,"Gesamt",null,null,null,null,null,null,null,null,null,null,null,null,"Gesamt"]
["wenn erforderlich",null,null,null,null,null,null,null,null,null,null,null,null,"wenn erforderlich"]
[4,null,null,null,null,null,null,null,null,null,null,null,null,4]
[null,null,null,null,null,null,null,null,null,"gewonnen",null,null,null,null,null,null,null,null,null,null,null,null,"gewonnen"]
[null,null,null,null,null,null,null,null,null,"verloren",null,null,null,null,null,null,null,null,null,null,null,null,"verloren"]
[null,"Schreiber:",null,null,null,null,null,"Kontrolle:",null,null,null,null,null,null,"Schreiber:",null,null,null,null,null,"Kontrolle:"]
[]
[]
["1/2 Finale",null,null,null,null,null,{"$f":"MR16_Baum!$K$58","v":"Scheibe: 14"},null,null,null,null,null,null,"1./2. od. 3./4. Platz",null,null,null,null,null,"Scheibe:"]
[null,1,2,"Summe","Punkte","Gesamt",null,null,null,null,null,null,null,null,1,2,"Summe","Punkte","Gesamt"]
[1,null,null,null,null,null,null,null,null,"Stechen",null,null,null,1,null,null,null,null,null,null,null,null,"Stechen"]
[null,null,null,null,null,null,null,null,1,null,null,null,null,null,null,null,null,null,null,null,null,1]
[null,null,null,null,null,null,null,null,2,null,null,null,null,null,null,null,null,null,null,null,null,2]
[2,null,null,null,null,null,null,null,3,null,null,null,null,2,null,null,null,null,null,null,null,3]
[]
[]
[3,null,null,null,null,null,null,null,"Punkte",null,null,null,null,3,null,null,null,null,null,null,null,"Punkte"]
[]
[null,null,null,null,null,null,null,null,"Gesamt",null,null,null,null,null,null,null,null,null,null,null,null,"Gesamt"]
["wenn erforderlich",null,null,null,null,null,null,null,null,null,null,null,null,"wenn erforderlich"]
[4,null,null,null,null,null,null,null,null,null,null,null,null,4]
[null,null,null,null,null,null,null,null,null,"gewonnen",null,null,null,null,null,null,null,null,null,null,null,null,"gewonnen"]
[null,null,null,null,null,null,null,null,null,"verloren",null,null,null,null,null,null,null,null,null,null,null,null,"verloren"]
[null,"Schreiber:",null,null,null,null,null,"Kontrolle:",null,null,null,null,null,null,"Schreiber:",null,null,null,null,null,"Kontrolle:"]
[]
[]
[]
[{"$f":"Select!$C$12","v":"ÖM Indoor 2019"},null,null,null,null,null,null,null,null,null,null,null,null,"Mannschaft:",null,null,{"$f":"MR16_Baum!$C$41","v":"RM_10"}]
["Veranstaltung"]
[{"$f":"Select!$C$13","v":"09.-10. Februar 2019"},null,null,null,null,null,null,null,null,null,null,null,null,"Schützen:",null,null,{"$f":"MR16_Baum!$C$42","v":"Schütze1_RM10 Schütze2_RM10"}]
["Datum"]
["Bewerb:",null,{"$f":"Select!$C$14","v":"Mannschaftsbewerb"},null,null,null,null,null,null,null,null,null,null,"Bogenklasse:",null,null,{"$f":"Select!$C$18","v":"Instinktivbogen Herren"}]
[]
[]
["1/8 Elimination",null,null,null,null,null,{"$f":"MR16_Baum!$C$68","v":"Scheibe: 44"},null,null,null,null,null,null,"1/4 Finale",null,null,null,null,null,{"$f":"MR16_Baum!$G$61","v":"Scheibe: 27"}]
[null,1,2,"Summe","Punkte","Gesamt",null,null,null,null,null,null,null,null,1,2,"Summe","Punkte","Gesamt"]
[1,null,null,null,null,null,null,null,null,"Stechen",null,null,null,1,null,null,null,null,null,null,null,null,"Stechen"]
[null,null,null,null,null,null,null,null,1,null,null,null,null,null,null,null,null,null,null,null,null,1]
[null,null,null,null,null,null,null,null,2,null,null,null,null,null,null,null,null,null,null,null,null,2]
[2,null,null,null,null,null,null,null,3,null,null,null,null,2,null,null,null,null,null,null,null,3]
[]
[]
[3,null,null,null,null,null,null,null,"Punkte",null,null,null,null,3,null,null,null,null,null,null,null,"Punkte"]
[]
[null,null,null,null,null,null,null,null,"Gesamt",null,null,null,null,null,null,null,null,null,null,null,null,"Gesamt"]
["wenn erforderlich",null,null,null,null,null,null,null,null,null,null,null,null,"wenn erforderlich"]
[4,null,null,null,null,null,null,null,null,null,null,null,null,4]
[null,null,null,null,null,null,null,null,null,"gewonnen",null,null,null,null,null,null,null,null,null,null,null,null,"gewonnen"]
[null,null,null,null,null,null,null,null,null,"verloren",null,null,null,null,null,null,null,null,null,null,null,null,"verloren"]
[null,"Schreiber:",null,null,null,null,null,"Kontrolle:",null,null,null,null,null,null,"Schreiber:",null,null,null,null,null,"Kontrolle:"]
[]
[]
["1/2 Finale",null,null,null,null,null,{"$f":"MR16_Baum!$K$58","v":"Scheibe: 14"},null,null,null,null,null,null,"1./2. od. 3./4. Platz",null,null,null,null,null,"Scheibe:"]
[null,1,2,"Summe","Punkte","Gesamt",null,null,null,null,null,null,null,null,1,2,"Summe","Punkte","Gesamt"]
[1,null,null,null,null,null,null,null,null,"Stechen",null,null,null,1,null,null,null,null,null,null,null,null,"Stechen"]
[null,null,null,null,null,null,null,null,1,null,null,null,null,null,null,null,null,null,null,null,null,1]
[null,null,null,null,null,null,null,null,2,null,null,null,null,null,null,null,null,null,null,null,null,2]
[2,null,null,null,null,null,null,null,3,null,null,null,null,2,null,null,null,null,null,null,null,3]
[]
[]
[3,null,null,null,null,null,null,null,"Punkte",null,null,null,null,3,null,null,null,null,null,null,null,"Punkte"]
[]
[null,null,null,null,null,null,null,null,"Gesamt",null,null,null,null,null,null,null,null,null,null,null,null,"Gesamt"]
["wenn erforderlich",null,null,null,null,null,null,null,null,null,null,null,null,"wenn erforderlich"]
[4,null,null,null,null,null,null,null,null,null,null,null,null,4]
[null,null,null,null,null,null,null,null,null,"gewonnen",null,null,null,null,null,null,null,null,null,null,null,null,"gewonnen"]
[null,null,null,null,null,null,null,null,null,"verloren",null,null,null,null,null,null,null,null,null,null,null,null,"verloren"]
[null,"Schreiber:",null,null,null,null,null,"Kontrolle:",null,null,null,null,null,null,"Schreiber:",null,null,null,null,null,"Kontrolle:"]
[]
[]
[]
[{"$f":"Select!$C$12","v":"ÖM Indoor 2019"},null,null,null,null,null,null,null,null,null,null,null,null,"Mannschaft:",null,null,{"$f":"MR16_Baum!$C$45","v":"RM_15"}]
["Veranstaltung"]
[{"$f":"Select!$C$13","v":"09.-10. Februar 2019"},null,null,null,null,null,null,null,null,null,null,null,null,"Schützen:",null,null,{"$f":"MR16_Baum!$C$46","v":"Schütze1_RM15 Schütze2_RM15"}]
["Datum"]
["Bewerb:",null,{"$f":"Select!$C$14","v":"Mannschaftsbewerb"},null,null,null,null,null,null,null,null,null,null,"Bogenklasse:",null,null,{"$f":"Select!$C$18","v":"Instinktivbogen Herren"}]
[]
[]
["1/8 Elimination",null,null,null,null,null,{"$f":"MR16_Baum!$C$69","v":"Scheibe: 45"},null,null,null,null,null,null,"1/4 Finale",null,null,null,null,null,{"$f":"MR16_Baum!$G$62","v":"Scheibe: 28"}]
[null,1,2,"Summe","Punkte","Gesamt",null,null,null,null,null,null,null,null,1,2,"Summe","Punkte","Gesamt"]
[1,null,null,null,null,null,null,null,null,"Stechen",null,null,null,1,null,null,null,null,null,null,null,null,"Stechen"]
[null,null,null,null,null,null,null,null,1,null,null,null,null,null,null,null,null,null,null,null,null,1]
[null,null,null,null,null,null,null,null,2,null,null,null,null,null,null,null,null,null,null,null,null,2]
[2,null,null,null,null,null,null,null,3,null,null,null,null,2,null,null,null,null,null,null,null,3]
[]
[]
[3,null,null,null,null,null,null,null,"Punkte",null,null,null,null,3,null,null,null,null,null,null,null,"Punkte"]
[]
[null,null,null,null,null,null,null,null,"Gesamt",null,null,null,null,null,null,null,null,null,null,null,null,"Gesamt"]
["wenn erforderlich",null,null,null,null,null,null,null,null,null,null,null,null,"wenn erforderlich"]
[4,null,null,null,null,null,null,null,null,null,null,null,null,4]
[null,null,null,null,null,null,null,null,null,"gewonnen",null,null,null,null,null,null,null,null,null,null,null,null,"gewonnen"]
[null,null,null,null,null,null,null,null,null,"verloren",null,null,null,null,null,null,null,null,null,null,null,null,"verloren"]
[null,"Schreiber:",null,null,null,null,null,"Kontrolle:",null,null,null,null,null,null,"Schreiber:",null,null,null,null,null,"Kontrolle:"]
[]
[]
["1/2 Finale",null,null,null,null,null,{"$f":"MR16_Baum!$K$58","v":"Scheibe: 14"},null,null,null,null,null,null,"1./2. od. 3./4. Platz",null,null,null,null,null,"Scheibe:"]
[null,1,2,"Summe","Punkte","Gesamt",null,null,null,null,null,null,null,null,1,2,"Summe","Punkte","Gesamt"]
[1,null,null,null,null,null,null,null,null,"Stechen",null,null,null,1,null,null,null,null,null,null,null,null,"Stechen"]
[null,null,null,null,null,null,null,null,1,null,null,null,null,null,null,null,null,null,null,null,null,1]
[null,null,null,null,null,null,null,null,2,null,null,null,null,null,null,null,null,null,null,null,null,2]
[2,null,null,null,null,null,null,null,3,null,null,null,null,2,null,null,null,null,null,null,null,3]
[]
[]
[3,null,null,null,null,null,null,null,"Punkte",null,null,null,null,3,null,null,null,null,null,null,null,"Punkte"]
[]
[null,null,null,null,null,null,null,null,"Gesamt",null,null,null,null,null,null,null,null,null,null,null,null,"Gesamt"]
["wenn erforderlich",null,null,null,null,null,null,null,null,null,null,null,null,"wenn erforderlich"]
[4,null,null,null,null,null,null,null,null,null,null,null,null,4]
[null,null,null,null,null,null,null,null,null,"gewonnen",null,null,null,null,null,null,null,null,null,null,null,null,"gewonnen"]
[null,null,null,null,null,null,null,null,null,"verloren",null,null,null,null,null,null,null,null,null,null,null,null,"verloren"]
[null,"Schreiber:",null,null,null,null,null,"Kontrolle:",null,null,null,null,null,null,"Schreiber:",null,null,null,null,null,"Kontrolle:"]
[]
[]
[]
[{"$f":"Select!$C$12","v":"ÖM Indoor 2019"},null,null,null,null,null,null,null,null,null,null,null,null,"Mannschaft:",null,null,{"$f":"MR16_Baum!$C$47","v":"RM_2"}]
["Veranstaltung"]
[{"$f":"Select!$C$13","v":"09.-10. Februar 2019"},null,null,null,null,null,null,null,null,null,null,null,null,"Schützen:",null,null,{"$f":"MR16_Baum!$C$48","v":"Schütze1_RM2 Schütze2_RM2"}]
["Datum"]
["Bewerb:",null,{"$f":"Select!$C$14","v":"Mannschaftsbewerb"},null,null,null,null,null,null,null,null,null,null,"Bogenklasse:",null,null,{"$f":"Select!$C$18","v":"Instinktivbogen Herren"}]
[]
[]
["1/8 Elimination",null,null,null,null,null,{"$f":"MR16_Baum!$C$70","v":"Scheibe: 46"},null,null,null,null,null,null,"1/4 Finale",null,null,null,null,null,{"$f":"MR16_Baum!$G$62","v":"Scheibe: 28"}]
[null,1,2,"Summe","Punkte","Gesamt",null,null,null,null,null,null,null,null,1,2,"Summe","Punkte","Gesamt"]
[1,null,null,null,null,null,null,null,null,"Stechen",null,null,null,1,null,null,null,null,null,null,null,null,"Stechen"]
[null,null,null,null,null,null,null,null,1,null,null,null,null,null,null,null,null,null,null,null,null,1]
[null,null,null,null,null,null,null,null,2,null,null,null,null,null,null,null,null,null,null,null,null,2]
[2,null,null,null,null,null,null,null,3,null,null,null,null,2,null,null,null,null,null,null,null,3]
[]
[]
[3,null,null,null,null,null,null,null,"Punkte",null,null,null,null,3,null,null,null,null,null,null,null,"Punkte"]
[]
[null,null,null,null,null,null,null,null,"Gesamt",null,null,null,null,null,null,null,null,null,null,null,null,"Gesamt"]
["wenn erforderlich",null,null,null,null,null,null,null,null,null,null,null,null,"wenn erforderlich"]
[4,null,null,null,null,null,null,null,null,null,null,null,null,4]
[null,null,null,null,null,null,null,null,null,"gewonnen",null,null,null,null,null,null,null,null,null,null,null,null,"gewonnen"]
[null,null,null,null,null,null,null,null,null,"verloren",null,null,null,null,null,null,null,null,null,null,null,null,"verloren"]
[null,"Schreiber:",null,null,null,null,null,"Kontrolle:",null,null,null,null,null,null,"Schreiber:",null,null,null,null,null,"Kontrolle:"]
[]
[]
["1/2 Finale",null,null,null,null,null,{"$f":"MR16_Baum!$K$58","v":"Scheibe: 14"},null,null,null,null,null,null,"1./2. od. 3./4. Platz",null,null,null,null,null,"Scheibe:"]
[null,1,2,"Summe","Punkte","Gesamt",null,null,null,null,null,null,null,null,1,2,"Summe","Punkte","Gesamt"]
[1,null,null,null,null,null,null,null,null,"Stechen",null,null,null,1,null,null,null,null,null,null,null,null,"Stechen"]
[null,null,null,null,null,null,null,null,1,null,null,null,null,null,null,null,null,null,null,null,null,1]
[null,null,null,null,null,null,null,null,2,null,null,null,null,null,null,null,null,null,null,null,null,2]
[2,null,null,null,null,null,null,null,3,null,null,null,null,2,null,null,null,null,null,null,null,3]
[]
[]
[3,null,null,null,null,null,null,null,"Punkte",null,null,null,null,3,null,null,null,null,null,null,null,"Punkte"]
[]
[null,null,null,null,null,null,null,null,"Gesamt",null,null,null,null,null,null,null,null,null,null,null,null,"Gesamt"]
["wenn erforderlich",null,null,null,null,null,null,null,null,null,null,null,null,"wenn erforderlich"]
[4,null,null,null,null,null,null,null,null,null,null,null,null,4]
[null,null,null,null,null,null,null,null,null,"gewonnen",null,null,null,null,null,null,null,null,null,null,null,null,"gewonnen"]
[null,null,null,null,null,null,null,null,null,"verloren",null,null,null,null,null,null,null,null,null,null,null,null,"verloren"]
[null,"Schreiber:",null,null,null,null,null,"Kontrolle:",null,null,null,null,null,null,"Schreiber:",null,null,null,null,null,"Kontrolle:"]

{"sheet":"MR16_Set","index":5,"n_rows":718,"n_cols":17,"rows_kept":718,"cut":false,"hidden":true,"merged":[[27,16,27,18],[5,14,5,17],[9,0,9,5],[9,6,9,8],[9,10,9,15],[9,16,9,18],[1,0,1,7],[1,14,1,17],[2,0,2,7],[3,0,3,7],[3,14,4,17],[4,0,4,7],[11,0,12,0],[11,10,12,10],[38,0,38,5],[38,10,38,15],[29,0,30,0],[29,10,30,10],[31,0,32,0],[31,10,32,10],[13,0,14,0],[13,10,14,10],[27,0,27,5],[27,6,27,8],[27,10,27,15],[18,10,19,10],[15,10,16,10],[18,0,19,0],[15,0,16,0],[17,0,17,5],[17,10,17,15],[20,0,20,5],[20,10,20,15],[35,0,35,5],[35,10,35,15],[33,10,34,10],[33,0,34,0],[72,16,72,18],[50,14,50,17],[54,0,54,5],[54,6,54,8],[54,10,54,15],[54,16,54,18],[46,0,46,7],[46,14,46,17],[47,0,47,7],[48,0,48,7],[48,14,49,17],[49,0,49,7],[56,0,57,0],[56,10,57,10],[62,0,62,5],[62,10,62,15],[65,0,65,5],[65,10,65,15],[63,0,64,0],[60,0,61,0],[117,16,117,18],[95,14,95,17],[99,0,99,5],[99,6,99,8],[99,10,99,15],[99,16,99,18],[81,0,82,0],[81,10,82,10],[91,0,91,7],[91,14,91,17],[92,0,92,7],[93,0,93,7],[93,14,94,17],[94,0,94,7],[110,0,110,5],[110,10,110,15],[105,0,106,0],[105,10,106,10],[103,0,104,0],[103,10,104,10],[117,0,117,5],[117,6,117,8],[117,10,117,15],[83,0,83,5],[136,0,136,7],[136,14,136,17],[137,0,137,7],[138,0,138,7],[138,14,139,17],[139,0,139,7],[155,0,155,5],[155,10,155,15],[153,0,154,0],[153,10,154,10],[148,0,149,0],[148,10,149,10],[152,0,152,5],[152,10,152,15],[150,10,151,10],[146,0,147,0],[146,10,147,10],[150,0,151,0],[181,0,181,7],[181,14,181,17],[182,0,182,7],[183,0,183,7],[183,14,184,17],[184,0,184,7],[162,16,162,18],[140,14,140,17],[144,0,144,5],[144,6,144,8],[144,10,144,15],[144,16,144,18],[162,0,162,5],[162,6,162,8],[162,10,162,15],[166,0,167,0],[166,10,167,10],[164,0,165,0],[164,10,165,10],[170,0,170,5],[170,10,170,15],[173,0,173,5],[173,10,173,15],[168,10,169,10],[168,0,169,0],[234,16,234,18],[171,0,172,0],[171,10,172,10],[226,0,226,7],[226,14,226,17],[227,0,227,7],[228,0,228,7],[228,14,229,17],[229,0,229,7],[207,16,207,18],[191,0,192,0],[191,10,192,10],[200,0,200,5],[200,10,200,15],[216,10,217,10],[213,10,214,10],[195,10,196,10],[195,0,196,0],[193,0,194,0],[193,10,194,10],[185,14,185,17],[189,0,189,5],[218,0,218,5],[189,6,189,8],[189,10,189,15],[252,16,252,18],[230,14,230,17],[234,0,234,5],[234,6,234,8],[197,0,197,5],[197,10,197,15],[198,0,199,0],[198,10,199,10],[218,10,218,15],[216,0,217,0],[213,0,214,0],[189,16,189,18],[275,14,275,17],[207,0,207,5],[207,6,207,8],[207,10,207,15],[234,10,234,15],[215,0,215,5],[215,10,215,15],[209,0,210,0],[209,10,210,10],[211,0,212,0],[211,10,212,10],[243,0,244,0],[243,10,244,10],[240,10,241,10],[240,0,241,0],[238,0,239,0],[238,10,239,10],[236,0,237,0],[236,10,237,10],[245,0,245,5],[245,10,245,15],[242,0,242,5],[242,10,242,15],[254,0,255,0],[254,10,255,10],[256,0,257,0],[256,10,257,10],[252,0,252,5],[252,6,252,8],[252,10,252,15],[279,0,279,5],[279,6,279,8],[279,10,279,15],[271,0,271,7],[271,14,271,17],[272,0,272,7],[273,0,273,7],[261,0,262,0],[258,0,259,0],[261,10,262,10],[273,14,274,17],[258,10,259,10],[260,0,260,5],[260,10,260,15],[274,0,274,7],[263,0,263,5],[263,10,263,15],[279,16,279,18],[353,10,353,15],[378,10,379,10],[375,10,376,10],[378,0,379,0],[375,0,376,0],[342,0,342,5],[342,6,342,8],[342,10,342,15],[320,14,320,17],[324,0,324,5],[324,6,324,8],[365,14,365,17],[369,0,369,5],[369,6,369,8],[288,10,289,10],[283,0,284,0],[299,0,300,0],[299,10,300,10],[301,0,302,0],[301,10,302,10],[283,10,284,10],[369,10,369,15],[369,16,369,18],[361,0,361,7],[361,14,361,17],[362,0,362,7],[363,0,363,7],[363,14,364,17],[364,0,364,7],[342,16,342,18],[348,10,349,10],[351,0,352,0],[348,0,349,0],[318,14,319,17],[319,0,319,7],[353,0,353,5],[333,0,334,0],[333,10,334,10],[281,0,282,0],[281,10,282,10],[330,0,331,0],[306,10,307,10],[303,10,304,10],[306,0,307,0],[303,0,304,0],[346,10,347,10],[350,0,350,5],[350,10,350,15],[316,0,316,7],[316,14,316,17],[317,0,317,7],[318,0,318,7],[326,0,327,0],[326,10,327,10],[335,0,335,5],[335,10,335,15],[344,0,345,0],[344,10,345,10],[290,10,290,15],[305,0,305,5],[305,10,305,15],[297,0,297,5],[455,14,455,17],[459,0,459,5],[459,6,459,8],[459,10,459,15],[459,16,459,18],[451,0,451,7],[451,14,451,17],[452,0,452,7],[453,0,453,7],[453,14,454,17],[454,0,454,7],[432,16,432,18],[297,16,297,18],[332,0,332,5],[332,10,332,15],[328,0,329,0],[328,10,329,10],[324,10,324,15],[324,16,324,18],[432,6,432,8],[423,10,424,10],[420,10,421,10],[373,10,374,10],[330,10,331,10],[380,0,380,5],[380,10,380,15],[377,0,377,5],[377,10,377,15],[297,6,297,8],[297,10,297,15],[389,10,390,10],[387,0,387,5],[387,6,387,8],[387,10,387,15],[387,16,387,18],[440,0,440,5],[440,10,440,15],[423,0,424,0],[420,0,421,0],[371,0,372,0],[371,10,372,10],[287,0,287,5],[287,10,287,15],[288,0,289,0],[389,0,390,0],[432,10,432,15],[410,14,410,17],[414,0,414,5],[414,6,414,8],[414,10,414,15],[414,16,414,18],[406,0,406,7],[406,14,406,17],[407,0,407,7],[408,0,408,7],[408,14,409,17],[409,0,409,7],[290,0,290,5],[373,0,374,0],[465,0,466,0],[586,14,586,17],[587,0,587,7],[588,0,588,7],[588,14,589,17],[589,0,589,7],[567,0,567,5],[567,6,567,8],[567,10,567,15],[567,16,567,18],[573,0,574,0],[573,10,574,10],[542,0,542,7],[543,0,543,7],[543,14,544,17],[544,0,544,7],[477,0,477,5],[477,6,477,8],[477,10,477,15],[477,16,477,18],[512,0,512,5],[512,10,512,15],[515,0,515,5],[524,0,525,0],[524,10,525,10],[513,10,514,10],[488,0,488,5],[488,10,488,15],[506,0,507,0],[506,10,507,10],[496,0,496,7],[496,14,496,17],[497,0,497,7],[508,0,509,0],[508,10,509,10],[498,0,498,7],[498,14,499,17],[499,0,499,7],[504,16,504,18],[522,0,522,5],[522,6,522,8],[522,10,522,15],[522,16,522,18],[500,14,500,17],[504,0,504,5],[504,6,504,8],[504,10,504,15],[515,10,515,15],[633,14,634,17],[634,0,634,7],[612,0,612,5],[612,6,612,8],[612,10,612,15],[612,16,612,18],[616,0,617,0],[616,10,617,10],[620,0,620,5],[620,10,620,15],[621,10,622,10],[621,0,622,0],[618,10,619,10],[618,0,619,0],[614,0,615,0],[614,10,615,10],[684,0,684,5],[684,6,684,8],[684,10,684,15],[684,16,684,18],[676,0,676,7],[676,14,676,17],[677,0,677,7],[678,0,678,7],[678,14,679,17],[679,0,679,7],[657,16,657,18],[346,0,347,0],[639,16,639,18],[308,0,308,5],[308,10,308,15],[461,10,462,10],[425,0,425,5],[425,10,425,15],[434,0,435,0],[434,10,435,10],[436,0,437,0],[436,10,437,10],[416,0,417,0],[416,10,417,10],[418,0,419,0],[418,10,419,10],[422,0,422,5],[422,10,422,15],[441,10,442,10],[438,10,439,10],[631,0,631,7],[631,14,631,17],[632,0,632,7],[633,0,633,7],[83,10,83,15],[101,0,102,0],[101,10,102,10],[107,0,107,5],[107,10,107,15],[108,10,109,10],[108,0,109,0],[128,0,128,5],[128,10,128,15],[119,0,120,0],[119,10,120,10],[121,0,122,0],[121,10,122,10],[125,0,125,5],[125,10,125,15],[123,10,124,10],[126,10,127,10],[76,0,77,0],[76,10,77,10],[74,0,75,0],[74,10,75,10],[80,0,80,5],[80,10,80,15],[58,0,59,0],[58,10,59,10],[72,0,72,5],[72,6,72,8],[72,10,72,15],[558,0,559,0],[526,0,527,0],[526,10,527,10],[530,0,530,5],[530,10,530,15],[533,0,533,5],[533,10,533,15],[531,10,532,10],[528,10,529,10],[531,0,532,0],[528,0,529,0],[545,14,545,17],[549,0,549,5],[549,6,549,8],[549,10,549,15],[549,16,549,18],[541,0,541,7],[541,14,541,17],[553,0,554,0],[553,10,554,10],[557,0,557,5],[557,10,557,15],[555,0,556,0],[555,10,556,10],[605,0,605,5],[605,10,605,15],[575,0,575,5],[575,10,575,15],[578,0,578,5],[578,10,578,15],[596,0,597,0],[596,10,597,10],[594,6,594,8],[594,10,594,15],[590,14,590,17],[594,0,594,5],[598,0,599,0],[598,10,599,10],[602,0,602,5],[602,10,602,15],[603,10,604,10],[600,10,601,10],[603,0,604,0],[600,0,601,0],[576,10,577,10],[576,0,577,0],[594,16,594,18],[586,0,586,7],[713,0,713,5],[713,10,713,15],[36,0,37,0],[36,10,37,10],[78,10,79,10],[78,0,79,0],[63,10,64,10],[60,10,61,10],[695,0,695,5],[695,10,695,15],[704,0,705,0],[704,10,705,10],[706,0,707,0],[706,10,707,10],[686,0,687,0],[686,10,687,10],[688,0,689,0],[688,10,689,10],[285,10,286,10],[285,0,286,0],[126,0,127,0],[123,0,124,0],[650,0,650,5],[650,10,650,15],[710,10,710,15],[659,0,660,0],[659,10,660,10],[648,10,649,10],[648,0,649,0],[623,0,623,5],[623,10,623,15],[641,0,642,0],[641,10,642,10],[643,0,644,0],[643,10,644,10],[668,0,668,5],[668,10,668,15],[666,10,667,10],[663,10,664,10],[666,0,667,0],[663,0,664,0],[647,0,647,5],[647,10,647,15],[645,10,646,10],[645,0,646,0],[661,0,662,0],[657,0,657,5],[680,14,680,17],[479,0,480,0],[479,10,480,10],[481,0,482,0],[481,10,482,10],[485,0,485,5],[485,10,485,15],[351,10,352,10],[391,0,392,0],[391,10,392,10],[395,0,395,5],[395,10,395,15],[398,0,398,5],[398,10,398,15],[396,10,397,10],[393,10,394,10],[396,0,397,0],[393,0,394,0],[432,0,432,5],[443,0,443,5],[443,10,443,15],[441,0,442,0],[438,0,439,0],[461,0,462,0],[468,0,469,0],[560,0,560,5],[560,10,560,15],[569,0,570,0],[569,10,570,10],[571,0,572,0],[571,10,572,10],[551,0,552,0],[551,10,552,10],[463,0,464,0],[463,10,464,10],[467,0,467,5],[467,10,467,15],[470,0,470,5],[470,10,470,15],[510,10,511,10],[510,0,511,0],[513,0,514,0],[558,10,559,10],[486,10,487,10],[483,10,484,10],[486,0,487,0],[483,0,484,0],[468,10,469,10],[465,10,466,10],[665,0,665,5],[665,10,665,15],[657,6,657,8],[657,10,657,15],[635,14,635,17],[639,0,639,5],[639,6,639,8],[639,10,639,15],[711,10,712,10],[708,10,709,10],[711,0,712,0],[708,0,709,0],[690,10,691,10],[693,0,694,0],[690,0,691,0],[693,10,694,10],[692,0,692,5],[692,10,692,15],[702,0,702,5],[702,6,702,8],[702,10,702,15],[661,10,662,10],[702,16,702,18],[710,0,710,5]]}
[]
[{"$f":"Select!$C$12","v":"ÖM Indoor 2019"},null,null,null,null,null,null,null,null,null,"Mannschaft:",null,null,null,{"$f":"MR16_Baum!$C$3","v":"RM_1"}]
["Veranstaltung"]
[{"$f":"Select!$C$13","v":"09.-10. Februar 2019"},null,null,null,null,null,null,null,null,null,"Schützen:",null,null,null,{"$f":"MR16_Baum!$C$4","v":"Schütze1_RM1 Schütze2_RM1"}]
["Datum"]
[null,null,null,null,null,null,null,null,null,null,"Bogenklasse:",null,null,null,{"$f":"Select!$C$18","v":"Instinktivbogen Herren"}]
[]
[]
[]
["1/8 Elimination",null,null,null,null,null,{"$f":"MR16_Baum!$C$55","v":"Scheibe: 31"},null,null,null,"1/4 Finale",null,null,null,null,null,{"$f":"MR16_Baum!$G$55","v":"Scheibe: 21"}]
[null,1,2,"Summe","Punkte","Gesamt",null,null,null,null,null,1,2,"Summe","Punkte","Gesamt"]
[1,null,null,null,null,null,null,null,null,null,1]
[]
[2,null,null,null,null,null,null,null,null,null,2]
[]
[3,null,null,null,null,null,null,null,null,null,3]
[]
["wenn erforderlich",null,null,null,null,null,null,null,null,null,"wenn erforderlich"]
[4,null,null,null,null,null,null,null,null,null,4]
[null,null,null,null,null,null,"gewonnen",null,null,null,null,null,null,null,null,null,"gewonnen"]
["Stechen wenn erforderlich",null,null,null,null,null,null,null,null,null,"Stechen wenn erforderlich"]
[null,null,null,null,null,null,"verloren",null,null,null,null,null,null,null,null,null,"verloren"]
[]
[]
[null,"Schreiber:",null,null,null,"Kontrolle:",null,null,null,null,null,"Schreiber:",null,null,null,"Kontrolle:"]
[]
[]
["1/2 Finale",null,null,null,null,null,{"$f":"MR16_Baum!$K$55","v":"Scheibe: 11"},null,null,null,"1./2. od. 3./4. Platz",null,null,null,null,null,"Scheibe:"]
[null,1,2,"Summe","Punkte","Gesamt",null,null,null,null,null,1,2,"Summe","Punkte","Gesamt"]
[1,null,null,null,null,null,null,null,null,null,1]
[]
[2,null,null,null,null,null,null,null,null,null,2]
[]
[3,null,null,null,null,null,null,null,null,null,3]
[]
["wenn erforderlich",null,null,null,null,null,null,null,null,null,"wenn erforderlich"]
[4,null,null,null,null,null,null,null,null,null,4]
[null,null,null,null,null,null,"gewonnen",null,null,null,null,null,null,null,null,null,"gewonnen"]
["Stechen wenn erforderlich",null,null,null,null,null,null,null,null,null,"Stechen wenn erforderlich"]
[null,null,null,null,null,null,"verloren",null,null,null,null,null,null,null,null,null,"verloren"]
[]
[]
[null,"Schreiber:",null,null,null,"Kontrolle:",null,null,null,null,null,"Schreiber:",null,null,null,"Kontrolle:"]
[]
[]
[]
[{"$f":"Select!$C$12","v":"ÖM Indoor 2019"},null,null,null,null,null,null,null,null,null,"Mannschaft:",null,null,null,{"$f":"MR16_Baum!$C$5","v":"RM_16"}]
["Veranstaltung"]
[{"$f":"Select!$C$13","v":"09.-10. Februar 2019"},null,null,null,null,null,null,null,null,null,"Schützen:",null,null,null,{"$f":"MR16_Baum!$C$6","v":"Schütze1_RM16  Schütze2_RM16"}]
["Datum"]
[null,null,null,null,null,null,null,null,null,null,"Bogenklasse:",null,null,null,{"$f":"Select!$C$18","v":"Instinktivbogen Herren"}]
[]
[]
[]
["1/8 Elimination",null,null,null,null,null,{"$f":"MR16_Baum!$C$56","v":"Scheibe: 32"},null,null,null,"1/4 Finale",null,null,null,null,null,{"$f":"MR16_Baum!$G$55","v":"Scheibe: 21"}]
[null,1,2,"Summe","Punkte","Gesamt",null,null,null,null,null,1,2,"Summe","Punkte","Gesamt"]
[1,null,null,null,null,null,null,null,null,null,1]
[]
[2,null,null,null,null,null,null,null,null,null,2]
[]
[3,null,null,null,null,null,null,null,null,null,3]
[]
["wenn erforderlich",null,null,null,null,null,null,null,null,null,"wenn erforderlich"]
[4,null,null,null,null,null,null,null,null,null,4]
[null,null,null,null,null,null,"gewonnen",null,null,null,null,null,null,null,null,null,"gewonnen"]
["Stechen wenn erforderlich",null,null,null,null,null,null,null,null,null,"Stechen wenn erforderlich"]
[null,null,null,null,null,null,"verloren",null,null,null,null,null,null,null,null,null,"verloren"]
[]
[]
[null,"Schreiber:",null,null,null,"Kontrolle:",null,null,null,null,null,"Schreiber:",null,null,null,"Kontrolle:"]
[]
[]
["1/2 Finale",null,null,null,null,null,{"$f":"MR16_Baum!$K$55","v":"Scheibe: 11"},null,null,null,"1./2. od. 3./4. Platz",null,null,null,null,null,"Scheibe:"]
[null,1,2,"Summe","Punkte","Gesamt",null,null,null,null,null,1,2,"Summe","Punkte","Gesamt"]
[1,null,null,null,null,null,null,null,null,null,1]
[]
[2,null,null,null,null,null,null,null,null,null,2]
[]
[3,null,null,null,null,null,null,null,null,null,3]
[]
["wenn erforderlich",null,null,null,null,null,null,null,null,null,"wenn erforderlich"]
[4,null,null,null,null,null,null,null,null,null,4]
[null,null,null,null,null,null,"gewonnen",null,null,null,null,null,null,null,null,null,"gewonnen"]
["Stechen wenn erforderlich",null,null,null,null,null,null,null,null,null,"Stechen wenn erforderlich"]
[null,null,null,null,null,null,"verloren",null,null,null,null,null,null,null,null,null,"verloren"]
[]
[]
[null,"Schreiber:",null,null,null,"Kontrolle:",null,null,null,null,null,"Schreiber:",null,null,null,"Kontrolle:"]
[]
[]
[]
[{"$f":"Select!$C$12","v":"ÖM Indoor 2019"},null,null,null,null,null,null,null,null,null,"Mannschaft:",null,null,null,{"$f":"MR16_Baum!$C$9","v":"RM_9"}]
["Veranstaltung"]
[{"$f":"Select!$C$13","v":"09.-10. Februar 2019"},null,null,null,null,null,null,null,null,null,"Schützen:",null,null,null,{"$f":"MR16_Baum!$C$10","v":"Schütze1_RM9 Schütze2_RM9"}]
["Datum"]
[null,null,null,null,null,null,null,null,null,null,"Bogenklasse:",null,null,null,{"$f":"Select!$C$18","v":"Instinktivbogen Herren"}]
[]
[]
[]
["1/8 Elimination",null,null,null,null,null,{"$f":"MR16_Baum!$C$57","v":"Scheibe: 33"},null,null,null,"1/4 Finale",null,null,null,null,null,{"$f":"MR16_Baum!$G$56","v":"Scheibe: 22"}]
[null,1,2,"Summe","Punkte","Gesamt",null,null,null,null,null,1,2,"Summe","Punkte","Gesamt"]
[1,null,null,null,null,null,null,null,null,null,1]
[]
[2,null,null,null,null,null,null,null,null,null,2]
[]
[3,null,null,null,null,null,null,null,null,null,3]
[]
["wenn erforderlich",null,null,null,null,null,null,null,null,null,"wenn erforderlich"]
[4,null,null,null,null,null,null,null,null,null,4]
[null,null,null,null,null,null,"gewonnen",null,null,null,null,null,null,null,null,null,"gewonnen"]
["Stechen wenn erforderlich",null,null,null,null,null,null,null,null,null,"Stechen wenn erforderlich"]
[null,null,null,null,null,null,"verloren",null,null,null,null,null,null,null,null,null,"verloren"]
[]
[]
[null,"Schreiber:",null,null,null,"Kontrolle:",null,null,null,null,null,"Schreiber:",null,null,null,"Kontrolle:"]
[]
[]
["1/2 Finale",null,null,null,null,null,{"$f":"MR16_Baum!$K$55","v":"Scheibe: 11"},null,null,null,"1./2. od. 3./4. Platz",null,null,null,null,null,"Scheibe:"]
[null,1,2,"Summe","Punkte","Gesamt",null,null,null,null,null,1,2,"Summe","Punkte","Gesamt"]
[1,null,null,null,null,null,null,null,null,null,1]
[]
[2,null,null,null,null,null,null,null,null,null,2]
[]
[3,null,null,null,null,null,null,null,null,null,3]
[]
["wenn erforderlich",null,null,null,null,null,null,null,null,null,"wenn erforderlich"]
[4,null,null,null,null,null,null,null,null,null,4]
[null,null,null,null,null,null,"gewonnen",null,null,null,null,null,null,null,null,null,"gewonnen"]
["Stechen wenn erforderlich",null,null,null,null,null,null,null,null,null,"Stechen wenn erforderlich"]
[null,null,null,null,null,null,"verloren",null,null,null,null,null,null,null,null,null,"verloren"]
[]
[]
[null,"Schreiber:",null,null,null,"Kontrolle:",null,null,null,null,null,"Schreiber:",null,null,null,"Kontrolle:"]
[]
[]
[]
[{"$f":"Select!$C$12","v":"ÖM Indoor 2019"},null,null,null,null,null,null,null,null,null,"Mannschaft:",null,null,null,{"$f":"MR16_Baum!$C$11","v":"RM_8"}]
["Veranstaltung"]
[{"$f":"Select!$C$13","v":"09.-10. Februar 2019"},null,null,null,null,null,null,null,null,null,"Schützen:",null,null,null,{"$f":"MR16_Baum!$C$12","v":"Schütze1_RM8 Schütze2_RM8"}]
["Datum"]
[null,null,null,null,null,null,null,null,null,null,"Bogenklasse:",null,null,null,{"$f":"Select!$C$18","v":"Instinktivbogen Herren"}]
[]
[]
[]
["1/8 Elimination",null,null,null,null,null,{"$f":"MR16_Baum!$C$58","v":"Scheibe: 34"},null,null,null,"1/4 Finale",null,null,null,null,null,{"$f":"MR16_Baum!$G$56","v":"Scheibe: 22"}]
[null,1,2,"Summe","Punkte","Gesamt",null,null,null,null,null,1,2,"Summe","Punkte","Gesamt"]
[1,null,null,null,null,null,null,null,null,null,1]
[]
[2,null,null,null,null,null,null,null,null,null,2]
[]
[3,null,null,null,null,null,null,null,null,null,3]
[]
["wenn erforderlich",null,null,null,null,null,null,null,null,null,"wenn erforderlich"]
[4,null,null,null,null,null,null,null,null,null,4]
[null,null,null,null,null,null,"gewonnen",null,null,null,null,null,null,null,null,null,"gewonnen"]
["Stechen wenn erforderlich",null,null,null,null,null,null,null,null,null,"Stechen wenn erforderlich"]
[null,null,null,null,null,null,"verloren",null,null,null,null,null,null,null,null,null,"verloren"]
[]
[]
[null,"Schreiber:",null,null,null,"Kontrolle:",null,null,null,null,null,"Schreiber:",null,null,null,"Kontrolle:"]
[]
[]
["1/2 Finale",null,null,null,null,null,{"$f":"MR16_Baum!$K$55","v":"Scheibe: 11"},null,null,null,"1./2. od. 3./4. Platz",null,null,null,null,null,"Scheibe:"]
[null,1,2,"Summe","Punkte","Gesamt",null,null,null,null,null,1,2,"Summe","Punkte","Gesamt"]
[1,null,null,null,null,null,null,null,null,null,1]
[]
[2,null,null,null,null,null,null,null,null,null,2]
[]
[3,null,null,null,null,null,null,null,null,null,3]
[]
["wenn erforderlich",null,null,null,null,null,null,null,null,null,"wenn erforderlich"]
[4,null,null,null,null,null,null,null,null,null,4]
[null,null,null,null,null,null,"gewonnen",null,null,null,null,null,null,null,null,null,"gewonnen"]
["Stechen wenn erforderlich",null,null,null,null,null,null,null,null,null,"Stechen wenn erforderlich"]
[null,null,null,null,null,null,"verloren",null,null,null,null,null,null,null,null,null,"verloren"]
[]
[]
[null,"Schreiber:",null,null,null,"Kontrolle:",null,null,null,null,null,"Schreiber:",null,null,null,"Kontrolle:"]
[]
[]
[]
[{"$f":"Select!$C$12","v":"ÖM Indoor 2019"},null,null,null,null,null,null,null,null,null,"Mannschaft:",null,null,null,{"$f":"MR16_Baum!$C$15","v":"RM_5"}]
["Veranstaltung"]
[{"$f":"Select!$C$13","v":"09.-10. Februar 2019"},null,null,null,null,null,null,null,null,null,"Schützen:",null,null,null,{"$f":"MR16_Baum!$C$16","v":"Schütze1_RM5 Schütze2_RM5"}]
["Datum"]
[null,null,null,null,null,null,null,null,null,null,"Bogenklasse:",null,null,null,{"$f":"Select!$C$18","v":"Instinktivbogen Herren"}]
[]
[]
[]
["1/8 Elimination",null,null,null,null,null,{"$f":"MR16_Baum!$C$59","v":"Scheibe: 35"},null,null,null,"1/4 Finale",null,null,null,null,null,{"$f":"MR16_Baum!$G$57","v":"Scheibe: 23"}]
[null,1,2,"Summe","Punkte","Gesamt",null,null,null,null,null,1,2,"Summe","Punkte","Gesamt"]
[1,null,null,null,null,null,null,null,null,null,1]
[]
[2,null,null,null,null,null,null,null,null,null,2]
[]
[3,null,null,null,null,null,null,null,null,null,3]
[]
["wenn erforderlich",null,null,null,null,null,null,null,null,null,"wenn erforderlich"]
[4,null,null,null,null,null,null,null,null,null,4]
[null,null,null,null,null,null,"gewonnen",null,null,null,null,null,null,null,null,null,"gewonnen"]
["Stechen wenn erforderlich",null,null,null,null,null,null,null,null,null,"Stechen wenn erforderlich"]
[null,null,null,null,null,null,"verloren",null,null,null,null,null,null,null,null,null,"verloren"]
[]
[]
[null,"Schreiber:",null,null,null,"Kontrolle:",null,null,null,null,null,"Schreiber:",null,null,null,"Kontrolle:"]
[]
[]
["1/2 Finale",null,null,null,null,null,{"$f":"MR16_Baum!$K$56","v":"Scheibe: 12"},null,null,null,"1./2. od. 3./4. Platz",null,null,null,null,null,"Scheibe:"]
[null,1,2,"Summe","Punkte","Gesamt",null,null,null,null,null,1,2,"Summe","Punkte","Gesamt"]
[1,null,null,null,null,null,null,null,null,null,1]
[]
[2,null,null,null,null,null,null,null,null,null,2]
[]
[3,null,null,null,null,null,null,null,null,null,3]
[]
["wenn erforderlich",null,null,null,null,null,null,null,null,null,"wenn erforderlich"]
[4,null,null,null,null,null,null,null,null,null,4]
[null,null,null,null,null,null,"gewonnen",null,null,null,null,null,null,null,null,null,"gewonnen"]
["Stechen wenn erforderlich",null,null,null,null,null,null,null,null,null,"Stechen wenn erforderlich"]
[null,null,null,null,null,null,"verloren",null,null,null,null,null,null,null,null,null,"verloren"]
[]
[]
[null,"Schreiber:",null,null,null,"Kontrolle:",null,null,null,null,null,"Schreiber:",null,null,null,"Kontrolle:"]
[]
[]
[]
[{"$f":"Select!$C$12","v":"ÖM Indoor 2019"},null,null,null,null,null,null,null,null,null,"Mannschaft:",null,null,null,{"$f":"MR16_Baum!$C$17","v":"RM_12"}]
["Veranstaltung"]
[{"$f":"Select!$C$13","v":"09.-10. Februar 2019"},null,null,null,null,null,null,null,null,null,"Schützen:",null,null,null,{"$f":"MR16_Baum!$C$18","v":"Schütze1_RM12  Schütze2_RM12"}]
["Datum"]
[null,null,null,null,null,null,null,null,null,null,"Bogenklasse:",null,null,null,{"$f":"Select!$C$18","v":"Instinktivbogen Herren"}]
[]
[]
[]
["1/8 Elimination",null,null,null,null,null,{"$f":"MR16_Baum!$C$60","v":"Scheibe: 36"},null,null,null,"1/4 Finale",null,null,null,null,null,{"$f":"MR16_Baum!$G$57","v":"Scheibe: 23"}]
[null,1,2,"Summe","Punkte","Gesamt",null,null,null,null,null,1,2,"Summe","Punkte","Gesamt"]
[1,null,null,null,null,null,null,null,null,null,1]
[]
[2,null,null,null,null,null,null,null,null,null,2]
[]
[3,null,null,null,null,null,null,null,null,null,3]
[]
["wenn erforderlich",null,null,null,null,null,null,null,null,null,"wenn erforderlich"]
[4,null,null,null,null,null,null,null,null,null,4]
[null,null,null,null,null,null,"gewonnen",null,null,null,null,null,null,null,null,null,"gewonnen"]
["Stechen wenn erforderlich",null,null,null,null,null,null,null,null,null,"Stechen wenn erforderlich"]
[null,null,null,null,null,null,"verloren",null,null,null,null,null,null,null,null,null,"verloren"]
[]
[]
[null,"Schreiber:",null,null,null,"Kontrolle:",null,null,null,null,null,"Schreiber:",null,null,null,"Kontrolle:"]
[]
[]
["1/2 Finale",null,null,null,null,null,{"$f":"MR16_Baum!$K$56","v":"Scheibe: 12"},null,null,null,"1./2. od. 3./4. Platz",null,null,null,null,null,"Scheibe:"]
[null,1,2,"Summe","Punkte","Gesamt",null,null,null,null,null,1,2,"Summe","Punkte","Gesamt"]
[1,null,null,null,null,null,null,null,null,null,1]
[]
[2,null,null,null,null,null,null,null,null,null,2]
[]
[3,null,null,null,null,null,null,null,null,null,3]
[]
["wenn erforderlich",null,null,null,null,null,null,null,null,null,"wenn erforderlich"]
[4,null,null,null,null,null,null,null,null,null,4]
[null,null,null,null,null,null,"gewonnen",null,null,null,null,null,null,null,null,null,"gewonnen"]
["Stechen wenn erforderlich",null,null,null,null,null,null,null,null,null,"Stechen wenn erforderlich"]
[null,null,null,null,null,null,"verloren",null,null,null,null,null,null,null,null,null,"verloren"]
[]
[]
[null,"Schreiber:",null,null,null,"Kontrolle:",null,null,null,null,null,"Schreiber:",null,null,null,"Kontrolle:"]
[]
[]
[]
[{"$f":"Select!$C$12","v":"ÖM Indoor 2019"},null,null,null,null,null,null,null,null,null,"Mannschaft:",null,null,null,{"$f":"MR16_Baum!$C$21","v":"RM_13"}]
["Veranstaltung"]
[{"$f":"Select!$C$13","v":"09.-10. Februar 2019"},null,null,null,null,null,null,null,null,null,"Schützen:",null,null,null,{"$f":"MR16_Baum!$C$22","v":"Schütze1_RM13  Schütze2_RM13 "}]
["Datum"]
[null,null,null,null,null,null,null,null,null,null,"Bogenklasse:",null,null,null,{"$f":"Select!$C$18","v":"Instinktivbogen Herren"}]
[]
[]
[]
["1/8 Elimination",null,null,null,null,null,{"$f":"MR16_Baum!$C$61","v":"Scheibe: 37"},null,null,null,"1/4 Finale",null,null,null,null,null,{"$f":"MR16_Baum!$G$58","v":"Scheibe: 24"}]
[null,1,2,"Summe","Punkte","Gesamt",null,null,null,null,null,1,2,"Summe","Punkte","Gesamt"]
[1,null,null,null,null,null,null,null,null,null,1]
[]
[2,null,null,null,null,null,null,null,null,null,2]
[]
[3,null,null,null,null,null,null,null,null,null,3]
[]
["wenn erforderlich",null,null,null,null,null,null,null,null,null,"wenn erforderlich"]
[4,null,null,null,null,null,null,null,null,null,4]
[null,null,null,null,null,null,"gewonnen",null,null,null,null,null,null,null,null,null,"gewonnen"]
["Stechen wenn erforderlich",null,null,null,null,null,null,null,null,null,"Stechen wenn erforderlich"]
[null,null,null,null,null,null,"verloren",null,null,null,null,null,null,null,null,null,"verloren"]
[]
[]
[null,"Schreiber:",null,null,null,"Kontrolle:",null,null,null,null,null,"Schreiber:",null,null,null,"Kontrolle:"]
[]
[]
["1/2 Finale",null,null,null,null,null,{"$f":"MR16_Baum!$K$56","v":"Scheibe: 12"},null,null,null,"1./2. od. 3./4. Platz",null,null,null,null,null,"Scheibe:"]
[null,1,2,"Summe","Punkte","Gesamt",null,null,null,null,null,1,2,"Summe","Punkte","Gesamt"]
[1,null,null,null,null,null,null,null,null,null,1]
[]
[2,null,null,null,null,null,null,null,null,null,2]
[]
[3,null,null,null,null,null,null,null,null,null,3]
[]
["wenn erforderlich",null,null,null,null,null,null,null,null,null,"wenn erforderlich"]
[4,null,null,null,null,null,null,null,null,null,4]
[null,null,null,null,null,null,"gewonnen",null,null,null,null,null,null,null,null,null,"gewonnen"]
["Stechen wenn erforderlich",null,null,null,null,null,null,null,null,null,"Stechen wenn erforderlich"]
[null,null,null,null,null,null,"verloren",null,null,null,null,null,null,null,null,null,"verloren"]
[]
[]
[null,"Schreiber:",null,null,null,"Kontrolle:",null,null,null,null,null,"Schreiber:",null,null,null,"Kontrolle:"]
[]
[]
[]
[{"$f":"Select!$C$12","v":"ÖM Indoor 2019"},null,null,null,null,null,null,null,null,null,"Mannschaft:",null,null,null,{"$f":"MR16_Baum!$C$23","v":"RM_4"}]
["Veranstaltung"]
[{"$f":"Select!$C$13","v":"09.-10. Februar 2019"},null,null,null,null,null,null,null,null,null,"Schützen:",null,null,null,{"$f":"MR16_Baum!$C$24","v":"Schütze1_RM4 Schütze2_RM4"}]
["Datum"]
[null,null,null,null,null,null,null,null,null,null,"Bogenklasse:",null,null,null,{"$f":"Select!$C$18","v":"Instinktivbogen Herren"}]
[]
[]
[]
["1/8 Elimination",null,null,null,null,null,{"$f":"MR16_Baum!$C$62","v":"Scheibe: 38"},null,null,null,"1/4 Finale",null,null,null,null,null,{"$f":"MR16_Baum!$G$58","v":"Scheibe: 24"}]
[null,1,2,"Summe","Punkte","Gesamt",null,null,null,null,null,1,2,"Summe","Punkte","Gesamt"]
[1,null,null,null,null,null,null,null,null,null,1]
[]
[2,null,null,null,null,null,null,null,null,null,2]
[]
[3,null,null,null,null,null,null,null,null,null,3]
[]
["wenn erforderlich",null,null,null,null,null,null,null,null,null,"wenn erforderlich"]
[4,null,null,null,null,null,null,null,null,null,4]
[null,null,null,null,null,null,"gewonnen",null,null,null,null,null,null,null,null,null,"gewonnen"]
["Stechen wenn erforderlich",null,null,null,null,null,null,null,null,null,"Stechen wenn erforderlich"]
[null,null,null,null,null,null,"verloren",null,null,null,null,null,null,null,null,null,"verloren"]
[]
[]
[null,"Schreiber:",null,null,null,"Kontrolle:",null,null,null,null,null,"Schreiber:",null,null,null,"Kontrolle:"]
[]
[]
["1/2 Finale",null,null,null,null,null,{"$f":"MR16_Baum!$K$56","v":"Scheibe: 12"},null,null,null,"1./2. od. 3./4. Platz",null,null,null,null,null,"Scheibe:"]
[null,1,2,"Summe","Punkte","Gesamt",null,null,null,null,null,1,2,"Summe","Punkte","Gesamt"]
[1,null,null,null,null,null,null,null,null,null,1]
[]
[2,null,null,null,null,null,null,null,null,null,2]
[]
[3,null,null,null,null,null,null,null,null,null,3]
[]
["wenn erforderlich",null,null,null,null,null,null,null,null,null,"wenn erforderlich"]
[4,null,null,null,null,null,null,null,null,null,4]
[null,null,null,null,null,null,"gewonnen",null,null,null,null,null,null,null,null,null,"gewonnen"]
["Stechen wenn erforderlich",null,null,null,null,null,null,null,null,null,"Stechen wenn erforderlich"]
[null,null,null,null,null,null,"verloren",null,null,null,null,null,null,null,null,null,"verloren"]
[]
[]
[null,"Schreiber:",null,null,null,"Kontrolle:",null,null,null,null,null,"Schreiber:",null,null,null,"Kontrolle:"]
[]
[]
[]
[{"$f":"Select!$C$12","v":"ÖM Indoor 2019"},null,null,null,null,null,null,null,null,null,"Mannschaft:",null,null,null,{"$f":"MR16_Baum!$C$27","v":"RM_3"}]
["Veranstaltung"]
[{"$f":"Select!$C$13","v":"09.-10. Februar 2019"},null,null,null,null,null,null,null,null,null,"Schützen:",null,null,null,{"$f":"MR16_Baum!$C$28","v":"Schütze1_RM3 Schütze2_RM3"}]
["Datum"]
[null,null,null,null,null,null,null,null,null,null,"Bogenklasse:",null,null,null,{"$f":"Select!$C$18","v":"Instinktivbogen Herren"}]
[]
[]
[]
["1/8 Elimination",null,null,null,null,null,{"$f":"MR16_Baum!$C$63","v":"Scheibe: 39"},null,null,null,"1/4 Finale",null,null,null,null,null,{"$f":"MR16_Baum!$G$59","v":"Scheibe: 25"}]
[null,1,2,"Summe","Punkte","Gesamt",null,null,null,null,null,1,2,"Summe","Punkte","Gesamt"]
[1,null,null,null,null,null,null,null,null,null,1]
[]
[2,null,null,null,null,null,null,null,null,null,2]
[]
[3,null,null,null,null,null,null,null,null,null,3]
[]
["wenn erforderlich",null,null,null,null,null,null,null,null,null,"wenn erforderlich"]
[4,null,null,null,null,null,null,null,null,null,4]
[null,null,null,null,null,null,"gewonnen",null,null,null,null,null,null,null,null,null,"gewonnen"]
["Stechen wenn erforderlich",null,null,null,null,null,null,null,null,null,"Stechen wenn erforderlich"]
[null,null,null,null,null,null,"verloren",null,null,null,null,null,null,null,null,null,"verloren"]
[]
[]
[null,"Schreiber:",null,null,null,"Kontrolle:",null,null,null,null,null,"Schreiber:",null,null,null,"Kontrolle:"]
[]
[]
["1/2 Finale",null,null,null,null,null,{"$f":"MR16_Baum!$K$57","v":"Scheibe: 13"},null,null,null,"1./2. od. 3./4. Platz",null,null,null,null,null,"Scheibe:"]
[null,1,2,"Summe","Punkte","Gesamt",null,null,null,null,null,1,2,"Summe","Punkte","Gesamt"]
[1,null,null,null,null,null,null,null,null,null,1]
[]
[2,null,null,null,null,null,null,null,null,null,2]
[]
[3,null,null,null,null,null,null,null,null,null,3]
[]
["wenn erforderlich",null,null,null,null,null,null,null,null,null,"wenn erforderlich"]
[4,null,null,null,null,null,null,null,null,null,4]
[null,null,null,null,null,null,"gewonnen",null,null,null,null,null,null,null,null,null,"gewonnen"]
["Stechen wenn erforderlich",null,null,null,null,null,null,null,null,null,"Stechen wenn erforderlich"]
[null,null,null,null,null,null,"verloren",null,null,null,null,null,null,null,null,null,"verloren"]
[]
[]
[null,"Schreiber:",null,null,null,"Kontrolle:",null,null,null,null,null,"Schreiber:",null,null,null,"Kontrolle:"]
[]
[]
[]
[{"$f":"Select!$C$12","v":"ÖM Indoor 2019"},null,null,null,null,null,null,null,null,null,"Mannschaft:",null,null,null,{"$f":"MR16_Baum!$C$29","v":"RM_14"}]
["Veranstaltung"]
[{"$f":"Select!$C$13","v":"09.-10. Februar 2019"},null,null,null,null,null,null,null,null,null,"Schützen:",null,null,null,{"$f":"MR16_Baum!$C$30","v":"Schütze1_RM14 Schütze2_RM14 "}]
["Datum"]
[null,null,null,null,null,null,null,null,null,null,"Bogenklasse:",null,null,null,{"$f":"Select!$C$18","v":"Instinktivbogen Herren"}]
[]
[]
[]
["1/8 Elimination",null,null,null,null,null,{"$f":"MR16_Baum!$C$64","v":"Scheibe: 40"},null,null,null,"1/4 Finale",null,null,null,null,null,{"$f":"MR16_Baum!$G$59","v":"Scheibe: 25"}]
[null,1,2,"Summe","Punkte","Gesamt",null,null,null,null,null,1,2,"Summe","Punkte","Gesamt"]
[1,null,null,null,null,null,null,null,null,null,1]
[]
[2,null,null,null,null,null,null,null,null,null,2]
[]
[3,null,null,null,null,null,null,null,null,null,3]
[]
["wenn erforderlich",null,null,null,null,null,null,null,null,null,"wenn erforderlich"]
[4,null,null,null,null,null,null,null,null,null,4]
[null,null,null,null,null,null,"gewonnen",null,null,null,null,null,null,null,null,null,"gewonnen"]
["Stechen wenn erforderlich",null,null,null,null,null,null,null,null,null,"Stechen wenn erforderlich"]
[null,null,null,null,null,null,"verloren",null,null,null,null,null,null,null,null,null,"verloren"]
[]
[]
[null,"Schreiber:",null,null,null,"Kontrolle:",null,null,null,null,null,"Schreiber:",null,null,null,"Kontrolle:"]
[]
[]
["1/2 Finale",null,null,null,null,null,{"$f":"MR16_Baum!$K$57","v":"Scheibe: 13"},null,null,null,"1./2. od. 3./4. Platz",null,null,null,null,null,"Scheibe:"]
[null,1,2,"Summe","Punkte","Gesamt",null,null,null,null,null,1,2,"Summe","Punkte","Gesamt"]
[1,null,null,null,null,null,null,null,null,null,1]
[]
[2,null,null,null,null,null,null,null,null,null,2]
[]
[3,null,null,null,null,null,null,null,null,null,3]
[]
["wenn erforderlich",null,null,null,null,null,null,null,null,null,"wenn erforderlich"]
[4,null,null,null,null,null,null,null,null,null,4]
[null,null,null,null,null,null,"gewonnen",null,null,null,null,null,null,null,null,null,"gewonnen"]
["Stechen wenn erforderlich",null,null,null,null,null,null,null,null,null,"Stechen wenn erforderlich"]
[null,null,null,null,null,null,"verloren",null,null,null,null,null,null,null,null,null,"verloren"]
[]
[]
[null,"Schreiber:",null,null,null,"Kontrolle:",null,null,null,null,null,"Schreiber:",null,null,null,"Kontrolle:"]
[]
[]
[]
[{"$f":"Select!$C$12","v":"ÖM Indoor 2019"},null,null,null,null,null,null,null,null,null,"Mannschaft:",null,null,null,{"$f":"MR16_Baum!$C$33","v":"RM_11"}]
["Veranstaltung"]
[{"$f":"Select!$C$13","v":"09.-10. Februar 2019"},null,null,null,null,null,null,null,null,null,"Schützen:",null,null,null,{"$f":"MR16_Baum!$C$34","v":"Schütze1_RM11 Schütze2_RM11"}]
["Datum"]
[null,null,null,null,null,null,null,null,null,null,"Bogenklasse:",null,null,null,{"$f":"Select!$C$18","v":"Instinktivbogen Herren"}]
[]
[]
[]
["1/8 Elimination",null,null,null,null,null,{"$f":"MR16_Baum!$C$65","v":"Scheibe: 41"},null,null,null,"1/4 Finale",null,null,null,null,null,{"$f":"MR16_Baum!$G$60","v":"Scheibe: 26"}]
[null,1,2,"Summe","Punkte","Gesamt",null,null,null,null,null,1,2,"Summe","Punkte","Gesamt"]
[1,null,null,null,null,null,null,null,null,null,1]
[]
[2,null,null,null,null,null,null,null,null,null,2]
[]
[3,null,null,null,null,null,null,null,null,null,3]
[]
["wenn erforderlich",null,null,null,null,null,null,null,null,null,"wenn erforderlich"]
[4,null,null,null,null,null,null,null,null,null,4]
[null,null,null,null,null,null,"gewonnen",null,null,null,null,null,null,null,null,null,"gewonnen"]
["Stechen wenn erforderlich",null,null,null,null,null,null,null,null,null,"Stechen wenn erforderlich"]
[null,null,null,null,null,null,"verloren",null,null,null,null,null,null,null,null,null,"verloren"]
[]
[]
[null,"Schreiber:",null,null,null,"Kontrolle:",null,null,null,null,null,"Schreiber:",null,null,null,"Kontrolle:"]
[]
[]
["1/2 Finale",null,null,null,null,null,{"$f":"MR16_Baum!$K$57","v":"Scheibe: 13"},null,null,null,"1./2. od. 3./4. Platz",null,null,null,null,null,"Scheibe:"]
[null,1,2,"Summe","Punkte","Gesamt",null,null,null,null,null,1,2,"Summe","Punkte","Gesamt"]
[1,null,null,null,null,null,null,null,null,null,1]
[]
[2,null,null,null,null,null,null,null,null,null,2]
[]
[3,null,null,null,null,null,null,null,null,null,3]
[]
["wenn erforderlich",null,null,null,null,null,null,null,null,null,"wenn erforderlich"]
[4,null,null,null,null,null,null,null,null,null,4]
[null,null,null,null,null,null,"gewonnen",null,null,null,null,null,null,null,null,null,"gewonnen"]
["Stechen wenn erforderlich",null,null,null,null,null,null,null,null,null,"Stechen wenn erforderlich"]
[null,null,null,null,null,null,"verloren",null,null,null,null,null,null,null,null,null,"verloren"]
[]
[]
[null,"Schreiber:",null,null,null,"Kontrolle:",null,null,null,null,null,"Schreiber:",null,null,null,"Kontrolle:"]
[]
[]
[]
[{"$f":"Select!$C$12","v":"ÖM Indoor 2019"},null,null,null,null,null,null,null,null,null,"Mannschaft:",null,null,null,{"$f":"MR16_Baum!$C$35","v":"RM_6"}]
["Veranstaltung"]
[{"$f":"Select!$C$13","v":"09.-10. Februar 2019"},null,null,null,null,null,null,null,null,null,"Schützen:",null,null,null,{"$f":"MR16_Baum!$C$36","v":"Schütze1_RM6 Schütze2_RM6"}]
["Datum"]
[null,null,null,null,null,null,null,null,null,null,"Bogenklasse:",null,null,null,{"$f":"Select!$C$18","v":"Instinktivbogen Herren"}]
[]
[]
[]
["1/8 Elimination",null,null,null,null,null,{"$f":"MR16_Baum!$C$66","v":"Scheibe: 42"},null,null,null,"1/4 Finale",null,null,null,null,null,{"$f":"MR16_Baum!$G$60","v":"Scheibe: 26"}]
[null,1,2,"Summe","Punkte","Gesamt",null,null,null,null,null,1,2,"Summe","Punkte","Gesamt"]
[1,null,null,null,null,null,null,null,null,null,1]
[]
[2,null,null,null,null,null,null,null,null,null,2]
[]
[3,null,null,null,null,null,null,null,null,null,3]
[]
["wenn erforderlich",null,null,null,null,null,null,null,null,null,"wenn erforderlich"]
[4,null,null,null,null,null,null,null,null,null,4]
[null,null,null,null,null,null,"gewonnen",null,null,null,null,null,null,null,null,null,"gewonnen"]
["Stechen wenn erforderlich",null,null,null,null,null,null,null,null,null,"Stechen wenn erforderlich"]
[null,null,null,null,null,null,"verloren",null,null,null,null,null,null,null,null,null,"verloren"]
[]
[]
[null,"Schreiber:",null,null,null,"Kontrolle:",null,null,null,null,null,"Schreiber:",null,null,null,"Kontrolle:"]
[]
[]
["1/2 Finale",null,null,null,null,null,{"$f":"MR16_Baum!$K$57","v":"Scheibe: 13"},null,null,null,"1./2. od. 3./4. Platz",null,null,null,null,null,"Scheibe:"]
[null,1,2,"Summe","Punkte","Gesamt",null,null,null,null,null,1,2,"Summe","Punkte","Gesamt"]
[1,null,null,null,null,null,null,null,null,null,1]
[]
[2,null,null,null,null,null,null,null,null,null,2]
[]
[3,null,null,null,null,null,null,null,null,null,3]
[]
["wenn erforderlich",null,null,null,null,null,null,null,null,null,"wenn erforderlich"]
[4,null,null,null,null,null,null,null,null,null,4]
[null,null,null,null,null,null,"gewonnen",null,null,null,null,null,null,null,null,null,"gewonnen"]
["Stechen wenn erforderlich",null,null,null,null,null,null,null,null,null,"Stechen wenn erforderlich"]
[null,null,null,null,null,null,"verloren",null,null,null,null,null,null,null,null,null,"verloren"]
[]
[]
[null,"Schreiber:",null,null,null,"Kontrolle:",null,null,null,null,null,"Schreiber:",null,null,null,"Kontrolle:"]
[]
[]
[]
[{"$f":"Select!$C$12","v":"ÖM Indoor 2019"},null,null,null,null,null,null,null,null,null,"Mannschaft:",null,null,null,{"$f":"MR16_Baum!$C$39","v":"RM_7"}]
["Veranstaltung"]
[{"$f":"Select!$C$13","v":"09.-10. Februar 2019"},null,null,null,null,null,null,null,null,null,"Schützen:",null,null,null,{"$f":"MR16_Baum!$C$40","v":"Schütze1_RM7 Schütze2_RM7"}]
["Datum"]
[null,null,null,null,null,null,null,null,null,null,"Bogenklasse:",null,null,null,{"$f":"Select!$C$18","v":"Instinktivbogen Herren"}]
[]
[]
[]
["1/8 Elimination",null,null,null,null,null,{"$f":"MR16_Baum!$C$67","v":"Scheibe: 43"},null,null,null,"1/4 Finale",null,null,null,null,null,{"$f":"MR16_Baum!$G$61","v":"Scheibe: 27"}]
[null,1,2,"Summe","Punkte","Gesamt",null,null,null,null,null,1,2,"Summe","Punkte","Gesamt"]
[1,null,null,null,null,null,null,null,null,null,1]
[]
[2,null,null,null,null,null,null,null,null,null,2]
[]
[3,null,null,null,null,null,null,null,null,null,3]
[]
["wenn erforderlich",null,null,null,null,null,null,null,null,null,"wenn erforderlich"]
[4,null,null,null,null,null,null,null,null,null,4]
[null,null,null,null,null,null,"gewonnen",null,null,null,null,null,null,null,null,null,"gewonnen"]
["Stechen wenn erforderlich",null,null,null,null,null,null,null,null,null,"Stechen wenn erforderlich"]
[null,null,null,null,null,null,"verloren",null,null,null,null,null,null,null,null,null,"verloren"]
[]
[]
[null,"Schreiber:",null,null,null,"Kontrolle:",null,null,null,null,null,"Schreiber:",null,null,null,"Kontrolle:"]
[]
[]
["1/2 Finale",null,null,null,null,null,{"$f":"MR16_Baum!$K$58","v":"Scheibe: 14"},null,null,null,"1./2. od. 3./4. Platz",null,null,null,null,null,"Scheibe:"]
[null,1,2,"Summe","Punkte","Gesamt",null,null,null,null,null,1,2,"Summe","Punkte","Gesamt"]
[1,null,null,null,null,null,null,null,null,null,1]
[]
[2,null,null,null,null,null,null,null,null,null,2]
[]
[3,null,null,null,null,null,null,null,null,null,3]
[]
["wenn erforderlich",null,null,null,null,null,null,null,null,null,"wenn erforderlich"]
[4,null,null,null,null,null,null,null,null,null,4]
[null,null,null,null,null,null,"gewonnen",null,null,null,null,null,null,null,null,null,"gewonnen"]
["Stechen wenn erforderlich",null,null,null,null,null,null,null,null,null,"Stechen wenn erforderlich"]
[null,null,null,null,null,null,"verloren",null,null,null,null,null,null,null,null,null,"verloren"]
[]
[]
[null,"Schreiber:",null,null,null,"Kontrolle:",null,null,null,null,null,"Schreiber:",null,null,null,"Kontrolle:"]
[]
[]
[]
[{"$f":"Select!$C$12","v":"ÖM Indoor 2019"},null,null,null,null,null,null,null,null,null,"Mannschaft:",null,null,null,{"$f":"MR16_Baum!$C$41","v":"RM_10"}]
["Veranstaltung"]
[{"$f":"Select!$C$13","v":"09.-10. Februar 2019"},null,null,null,null,null,null,null,null,null,"Schützen:",null,null,null,{"$f":"MR16_Baum!$C$42","v":"Schütze1_RM10 Schütze2_RM10"}]
["Datum"]
[null,null,null,null,null,null,null,null,null,null,"Bogenklasse:",null,null,null,{"$f":"Select!$C$18","v":"Instinktivbogen Herren"}]
[]
[]
[]
["1/8 Elimination",null,null,null,null,null,{"$f":"MR16_Baum!$C$68","v":"Scheibe: 44"},null,null,null,"1/4 Finale",null,null,null,null,null,{"$f":"MR16_Baum!$G$61","v":"Scheibe: 27"}]
[null,1,2,"Summe","Punkte","Gesamt",null,null,null,null,null,1,2,"Summe","Punkte","Gesamt"]
[1,null,null,null,null,null,null,null,null,null,1]
[]
[2,null,null,null,null,null,null,null,null,null,2]
[]
[3,null,null,null,null,null,null,null,null,null,3]
[]
["wenn erforderlich",null,null,null,null,null,null,null,null,null,"wenn erforderlich"]
[4,null,null,null,null,null,null,null,null,null,4]
[null,null,null,null,null,null,"gewonnen",null,null,null,null,null,null,null,null,null,"gewonnen"]
["Stechen wenn erforderlich",null,null,null,null,null,null,null,null,null,"Stechen wenn erforderlich"]
[null,null,null,null,null,null,"verloren",null,null,null,null,null,null,null,null,null,"verloren"]
[]
[]
[null,"Schreiber:",null,null,null,"Kontrolle:",null,null,null,null,null,"Schreiber:",null,null,null,"Kontrolle:"]
[]
[]
["1/2 Finale",null,null,null,null,null,{"$f":"MR16_Baum!$K$58","v":"Scheibe: 14"},null,null,null,"1./2. od. 3./4. Platz",null,null,null,null,null,"Scheibe:"]
[null,1,2,"Summe","Punkte","Gesamt",null,null,null,null,null,1,2,"Summe","Punkte","Gesamt"]
[1,null,null,null,null,null,null,null,null,null,1]
[]
[2,null,null,null,null,null,null,null,null,null,2]
[]
[3,null,null,null,null,null,null,null,null,null,3]
[]
["wenn erforderlich",null,null,null,null,null,null,null,null,null,"wenn erforderlich"]
[4,null,null,null,null,null,null,null,null,null,4]
[null,null,null,null,null,null,"gewonnen",null,null,null,null,null,null,null,null,null,"gewonnen"]
["Stechen wenn erforderlich",null,null,null,null,null,null,null,null,null,"Stechen wenn erforderlich"]
[null,null,null,null,null,null,"verloren",null,null,null,null,null,null,null,null,null,"verloren"]
[]
[]
[null,"Schreiber:",null,null,null,"Kontrolle:",null,null,null,null,null,"Schreiber:",null,null,null,"Kontrolle:"]
[]
[]
[]
[{"$f":"Select!$C$12","v":"ÖM Indoor 2019"},null,null,null,null,null,null,null,null,null,"Mannschaft:",null,null,null,{"$f":"MR16_Baum!$C$45","v":"RM_15"}]
["Veranstaltung"]
[{"$f":"Select!$C$13","v":"09.-10. Februar 2019"},null,null,null,null,null,null,null,null,null,"Schützen:",null,null,null,{"$f":"MR16_Baum!$C$46","v":"Schütze1_RM15 Schütze2_RM15"}]
["Datum"]
[null,null,null,null,null,null,null,null,null,null,"Bogenklasse:",null,null,null,{"$f":"Select!$C$18","v":"Instinktivbogen Herren"}]
[]
[]
[]
["1/8 Elimination",null,null,null,null,null,{"$f":"MR16_Baum!$C$69","v":"Scheibe: 45"},null,null,null,"1/4 Finale",null,null,null,null,null,{"$f":"MR16_Baum!$G$62","v":"Scheibe: 28"}]
[null,1,2,"Summe","Punkte","Gesamt",null,null,null,null,null,1,2,"Summe","Punkte","Gesamt"]
[1,null,null,null,null,null,null,null,null,null,1]
[]
[2,null,null,null,null,null,null,null,null,null,2]
[]
[3,null,null,null,null,null,null,null,null,null,3]
[]
["wenn erforderlich",null,null,null,null,null,null,null,null,null,"wenn erforderlich"]
[4,null,null,null,null,null,null,null,null,null,4]
[null,null,null,null,null,null,"gewonnen",null,null,null,null,null,null,null,null,null,"gewonnen"]
["Stechen wenn erforderlich",null,null,null,null,null,null,null,null,null,"Stechen wenn erforderlich"]
[null,null,null,null,null,null,"verloren",null,null,null,null,null,null,null,null,null,"verloren"]
[]
[]
[null,"Schreiber:",null,null,null,"Kontrolle:",null,null,null,null,null,"Schreiber:",null,null,null,"Kontrolle:"]
[]
[]
["1/2 Finale",null,null,null,null,null,{"$f":"MR16_Baum!$K$58","v":"Scheibe: 14"},null,null,null,"1./2. od. 3./4. Platz",null,null,null,null,null,"Scheibe:"]
[null,1,2,"Summe","Punkte","Gesamt",null,null,null,null,null,1,2,"Summe","Punkte","Gesamt"]
[1,null,null,null,null,null,null,null,null,null,1]
[]
[2,null,null,null,null,null,null,null,null,null,2]
[]
[3,null,null,null,null,null,null,null,null,null,3]
[]
["wenn erforderlich",null,null,null,null,null,null,null,null,null,"wenn erforderlich"]
[4,null,null,null,null,null,null,null,null,null,4]
[null,null,null,null,null,null,"gewonnen",null,null,null,null,null,null,null,null,null,"gewonnen"]
["Stechen wenn erforderlich",null,null,null,null,null,null,null,null,null,"Stechen wenn erforderlich"]
[null,null,null,null,null,null,"verloren",null,null,null,null,null,null,null,null,null,"verloren"]
[]
[]
[null,"Schreiber:",null,null,null,"Kontrolle:",null,null,null,null,null,"Schreiber:",null,null,null,"Kontrolle:"]
[]
[]
[]
[{"$f":"Select!$C$12","v":"ÖM Indoor 2019"},null,null,null,null,null,null,null,null,null,"Mannschaft:",null,null,null,{"$f":"MR16_Baum!$C$47","v":"RM_2"}]
["Veranstaltung"]
[{"$f":"Select!$C$13","v":"09.-10. Februar 2019"},null,null,null,null,null,null,null,null,null,"Schützen:",null,null,null,{"$f":"MR16_Baum!$C$48","v":"Schütze1_RM2 Schütze2_RM2"}]
["Datum"]
[null,null,null,null,null,null,null,null,null,null,"Bogenklasse:",null,null,null,{"$f":"Select!$C$18","v":"Instinktivbogen Herren"}]
[]
[]
[]
["1/8 Elimination",null,null,null,null,null,{"$f":"MR16_Baum!$C$70","v":"Scheibe: 46"},null,null,null,"1/4 Finale",null,null,null,null,null,{"$f":"MR16_Baum!$G$62","v":"Scheibe: 28"}]
[null,1,2,"Summe","Punkte","Gesamt",null,null,null,null,null,1,2,"Summe","Punkte","Gesamt"]
[1,null,null,null,null,null,null,null,null,null,1]
[]
[2,null,null,null,null,null,null,null,null,null,2]
[]
[3,null,null,null,null,null,null,null,null,null,3]
[]
["wenn erforderlich",null,null,null,null,null,null,null,null,null,"wenn erforderlich"]
[4,null,null,null,null,null,null,null,null,null,4]
[null,null,null,null,null,null,"gewonnen",null,null,null,null,null,null,null,null,null,"gewonnen"]
["Stechen wenn erforderlich",null,null,null,null,null,null,null,null,null,"Stechen wenn erforderlich"]
[null,null,null,null,null,null,"verloren",null,null,null,null,null,null,null,null,null,"verloren"]
[]
[]
[null,"Schreiber:",null,null,null,"Kontrolle:",null,null,null,null,null,"Schreiber:",null,null,null,"Kontrolle:"]
[]
[]
["1/2 Finale",null,null,null,null,null,{"$f":"MR16_Baum!$K$58","v":"Scheibe: 14"},null,null,null,"1./2. od. 3./4. Platz",null,null,null,null,null,"Scheibe:"]
[null,1,2,"Summe","Punkte","Gesamt",null,null,null,null,null,1,2,"Summe","Punkte","Gesamt"]
[1,null,null,null,null,null,null,null,null,null,1]
[]
[2,null,null,null,null,null,null,null,null,null,2]
[]
[3,null,null,null,null,null,null,null,null,null,3]
[]
["wenn erforderlich",null,null,null,null,null,null,null,null,null,"wenn erforderlich"]
[4,null,null,null,null,null,null,null,null,null,4]
[null,null,null,null,null,null,"gewonnen",null,null,null,null,null,null,null,null,null,"gewonnen"]
["Stechen wenn erforderlich",null,null,null,null,null,null,null,null,null,"Stechen wenn erforderlich"]
[null,null,null,null,null,null,"verloren",null,null,null,null,null,null,null,null,null,"verloren"]
[]
[]
[null,"Schreiber:",null,null,null,"Kontrolle:",null,null,null,null,null,"Schreiber:",null,null,null,"Kontrolle:"]

{"sheet":"MRX16","index":6,"n_rows":702,"n_cols":21,"rows_kept":702,"cut":false,"hidden":true,"merged":[[693,19,694,20],[695,0,696,0],[695,12,696,12],[688,0,689,0],[688,12,689,12],[690,0,691,0],[690,12,691,12],[692,0,693,0],[692,12,693,12],[693,7,694,8],[675,19,676,20],[677,0,678,0],[677,12,678,12],[686,0,686,5],[686,6,686,10],[686,12,686,17],[686,18,686,22],[670,0,671,0],[670,12,671,12],[672,0,673,0],[672,12,673,12],[674,0,675,0],[674,12,675,12],[675,7,676,8],[663,0,663,9],[663,15,664,21],[664,0,664,9],[665,15,665,21],[668,0,668,5],[668,6,668,10],[668,12,668,17],[668,18,668,22],[649,19,650,20],[651,0,652,0],[651,12,652,12],[661,0,661,9],[661,15,661,21],[662,0,662,9],[665,2,665,10],[644,0,645,0],[644,12,645,12],[646,0,647,0],[646,12,647,12],[648,0,649,0],[648,12,649,12],[649,7,650,8],[631,19,632,20],[633,0,634,0],[633,12,634,12],[642,0,642,5],[642,6,642,10],[642,12,642,17],[642,18,642,22],[626,0,627,0],[626,12,627,12],[628,0,629,0],[628,12,629,12],[630,0,631,0],[630,12,631,12],[631,7,632,8],[619,0,619,9],[619,15,620,21],[620,0,620,9],[621,15,621,21],[624,0,624,5],[624,6,624,10],[624,12,624,17],[624,18,624,22],[621,2,621,10],[605,19,606,20],[607,0,608,0],[607,12,608,12],[617,0,617,9],[617,15,617,21],[618,0,618,9],[600,0,601,0],[600,12,601,12],[602,0,603,0],[602,12,603,12],[604,0,605,0],[604,12,605,12],[605,7,606,8],[587,19,588,20],[589,0,590,0],[589,12,590,12],[598,0,598,5],[598,6,598,10],[598,12,598,17],[598,18,598,22],[582,0,583,0],[582,12,583,12],[584,0,585,0],[584,12,585,12],[586,0,587,0],[586,12,587,12],[587,7,588,8],[575,0,575,9],[575,15,576,21],[576,0,576,9],[577,15,577,21],[580,0,580,5],[580,6,580,10],[580,12,580,17],[580,18,580,22],[561,19,562,20],[563,0,564,0],[563,12,564,12],[573,0,573,9],[573,15,573,21],[574,0,574,9],[577,2,577,10],[556,0,557,0],[556,12,557,12],[558,0,559,0],[558,12,559,12],[560,0,561,0],[560,12,561,12],[561,7,562,8],[543,19,544,20],[545,0,546,0],[545,12,546,12],[554,0,554,5],[554,6,554,10],[554,12,554,17],[554,18,554,22],[538,0,539,0],[538,12,539,12],[540,0,541,0],[540,12,541,12],[542,0,543,0],[542,12,543,12],[543,7,544,8],[531,0,531,9],[531,15,532,21],[532,0,532,9],[533,15,533,21],[536,0,536,5],[536,6,536,10],[536,12,536,17],[536,18,536,22],[533,2,533,10],[517,19,518,20],[519,0,520,0],[519,12,520,12],[529,0,529,9],[529,15,529,21],[530,0,530,9],[512,0,513,0],[512,12,513,12],[514,0,515,0],[514,12,515,12],[516,0,517,0],[516,12,517,12],[517,7,518,8],[499,19,500,20],[501,0,502,0],[501,12,502,12],[510,0,510,5],[510,6,510,10],[510,12,510,17],[510,18,510,22],[494,0,495,0],[494,12,495,12],[496,0,497,0],[496,12,497,12],[498,0,499,0],[498,12,499,12],[499,7,500,8],[487,0,487,9],[487,15,488,21],[488,0,488,9],[489,15,489,21],[492,0,492,5],[492,6,492,10],[492,12,492,17],[492,18,492,22],[473,19,474,20],[475,0,476,0],[475,12,476,12],[485,0,485,9],[485,15,485,21],[486,0,486,9],[489,2,489,10],[468,0,469,0],[468,12,469,12],[470,0,471,0],[470,12,471,12],[472,0,473,0],[472,12,473,12],[473,7,474,8],[455,19,456,20],[457,0,458,0],[457,12,458,12],[466,0,466,5],[466,6,466,10],[466,12,466,17],[466,18,466,22],[450,0,451,0],[450,12,451,12],[452,0,453,0],[452,12,453,12],[454,0,455,0],[454,12,455,12],[455,7,456,8],[443,0,443,9],[443,15,444,21],[444,0,444,9],[445,15,445,21],[448,0,448,5],[448,6,448,10],[448,12,448,17],[448,18,448,22],[445,2,445,10],[429,19,430,20],[431,0,432,0],[431,12,432,12],[441,0,441,9],[441,15,441,21],[442,0,442,9],[424,0,425,0],[424,12,425,12],[426,0,427,0],[426,12,427,12],[428,0,429,0],[428,12,429,12],[429,7,430,8],[411,19,412,20],[413,0,414,0],[413,12,414,12],[422,0,422,5],[422,6,422,10],[422,12,422,17],[422,18,422,22],[406,0,407,0],[406,12,407,12],[408,0,409,0],[408,12,409,12],[410,0,411,0],[410,12,411,12],[411,7,412,8],[399,0,399,9],[399,15,400,21],[400,0,400,9],[401,15,401,21],[404,0,404,5],[404,6,404,10],[404,12,404,17],[404,18,404,22],[385,19,386,20],[387,0,388,0],[387,12,388,12],[397,0,397,9],[397,15,397,21],[398,0,398,9],[401,2,401,10],[380,0,381,0],[380,12,381,12],[382,0,383,0],[382,12,383,12],[384,0,385,0],[384,12,385,12],[385,7,386,8],[367,19,368,20],[369,0,370,0],[369,12,370,12],[378,0,378,5],[378,6,378,10],[378,12,378,17],[378,18,378,22],[362,0,363,0],[362,12,363,12],[364,0,365,0],[364,12,365,12],[366,0,367,0],[366,12,367,12],[367,7,368,8],[355,0,355,9],[355,15,356,21],[356,0,356,9],[357,15,357,21],[360,0,360,5],[360,6,360,10],[360,12,360,17],[360,18,360,22],[357,2,357,10],[341,19,342,20],[343,0,344,0],[343,12,344,12],[353,0,353,9],[353,15,353,21],[354,0,354,9],[336,0,337,0],[336,12,337,12],[338,0,339,0],[338,12,339,12],[340,0,341,0],[340,12,341,12],[341,7,342,8],[323,19,324,20],[325,0,326,0],[325,12,326,12],[334,0,334,5],[334,6,334,10],[334,12,334,17],[334,18,334,22],[318,0,319,0],[318,12,319,12],[320,0,321,0],[320,12,321,12],[322,0,323,0],[322,12,323,12],[323,7,324,8],[311,0,311,9],[311,15,312,21],[312,0,312,9],[313,15,313,21],[316,0,316,5],[316,6,316,10],[316,12,316,17],[316,18,316,22],[297,19,298,20],[299,0,300,0],[299,12,300,12],[309,0,309,9],[309,15,309,21],[310,0,310,9],[313,2,313,10],[292,0,293,0],[292,12,293,12],[294,0,295,0],[294,12,295,12],[296,0,297,0],[296,12,297,12],[297,7,298,8],[279,19,280,20],[281,0,282,0],[281,12,282,12],[290,0,290,5],[290,6,290,10],[290,12,290,17],[290,18,290,22],[274,0,275,0],[274,12,275,12],[276,0,277,0],[276,12,277,12],[278,0,279,0],[278,12,279,12],[279,7,280,8],[267,0,267,9],[267,15,268,21],[268,0,268,9],[269,15,269,21],[272,0,272,5],[272,6,272,10],[272,12,272,17],[272,18,272,22],[269,2,269,10],[253,19,254,20],[255,0,256,0],[255,12,256,12],[265,0,265,9],[265,15,265,21],[266,0,266,9],[248,0,249,0],[248,12,249,12],[250,0,251,0],[250,12,251,12],[252,0,253,0],[252,12,253,12],[253,7,254,8],[235,19,236,20],[237,0,238,0],[237,12,238,12],[246,0,246,5],[246,6,246,10],[246,12,246,17],[246,18,246,22],[230,0,231,0],[230,12,231,12],[232,0,233,0],[232,12,233,12],[234,0,235,0],[234,12,235,12],[235,7,236,8],[223,0,223,9],[223,15,224,21],[224,0,224,9],[225,15,225,21],[228,0,228,5],[228,6,228,10],[228,12,228,17],[228,18,228,22],[209,19,210,20],[211,0,212,0],[211,12,212,12],[221,0,221,9],[221,15,221,21],[222,0,222,9],[225,2,225,10],[204,0,205,0],[204,12,205,12],[206,0,207,0],[206,12,207,12],[208,0,209,0],[208,12,209,12],[209,7,210,8],[191,19,192,20],[193,0,194,0],[193,12,194,12],[202,0,202,5],[202,6,202,10],[202,12,202,17],[202,18,202,22],[186,0,187,0],[186,12,187,12],[188,0,189,0],[188,12,189,12],[190,0,191,0],[190,12,191,12],[191,7,192,8],[179,0,179,9],[179,15,180,21],[180,0,180,9],[181,15,181,21],[184,0,184,5],[184,6,184,10],[184,12,184,17],[184,18,184,22],[181,2,181,10],[165,19,166,20],[167,0,168,0],[167,12,168,12],[177,0,177,9],[177,15,177,21],[178,0,178,9],[160,0,161,0],[160,12,161,12],[162,0,163,0],[162,12,163,12],[164,0,165,0],[164,12,165,12],[165,7,166,8],[147,19,148,20],[149,0,150,0],[149,12,150,12],[158,0,158,5],[158,6,158,10],[158,12,158,17],[158,18,158,22],[142,0,143,0],[142,12,143,12],[144,0,145,0],[144,12,145,12],[146,0,147,0],[146,12,147,12],[147,7,148,8],[135,0,135,9],[135,15,136,21],[136,0,136,9],[137,15,137,21],[140,0,140,5],[140,6,140,10],[140,12,140,17],[140,18,140,22],[121,19,122,20],[123,0,124,0],[123,12,124,12],[133,0,133,9],[133,15,133,21],[134,0,134,9],[137,2,137,10],[116,0,117,0],[116,12,117,12],[118,0,119,0],[118,12,119,12],[120,0,121,0],[120,12,121,12],[121,7,122,8],[103,19,104,20],[105,0,106,0],[105,12,106,12],[114,0,114,5],[114,6,114,10],[114,12,114,17],[114,18,114,22],[98,0,99,0],[98,12,99,12],[100,0,101,0],[100,12,101,12],[102,0,103,0],[102,12,103,12],[103,7,104,8],[91,0,91,9],[91,15,92,21],[92,0,92,9],[93,15,93,21],[96,0,96,5],[96,6,96,10],[96,12,96,17],[96,18,96,22],[93,2,93,10],[77,19,78,20],[79,0,80,0],[79,12,80,12],[89,0,89,9],[89,15,89,21],[90,0,90,9],[72,0,73,0],[72,12,73,12],[74,0,75,0],[74,12,75,12],[76,0,77,0],[76,12,77,12],[77,7,78,8],[59,19,60,20],[61,0,62,0],[61,12,62,12],[70,0,70,5],[70,6,70,10],[70,12,70,17],[70,18,70,22],[54,0,55,0],[54,12,55,12],[56,0,57,0],[56,12,57,12],[58,0,59,0],[58,12,59,12],[59,7,60,8],[47,0,47,9],[47,15,48,21],[48,0,48,9],[49,15,49,21],[52,0,52,5],[52,6,52,10],[52,12,52,17],[52,18,52,22],[33,19,34,20],[35,0,36,0],[35,12,36,12],[45,0,45,9],[45,15,45,21],[46,0,46,9],[49,2,49,10],[28,0,29,0],[28,12,29,12],[30,0,31,0],[30,12,31,12],[32,0,33,0],[32,12,33,12],[33,7,34,8],[17,0,18,0],[17,12,18,12],[26,0,26,5],[26,6,26,10],[26,12,26,17],[1,0,1,9],[1,15,1,21],[2,0,2,9],[3,0,3,9],[3,15,4,21],[4,0,4,9],[26,18,26,22],[12,0,13,0],[12,12,13,12],[14,0,15,0],[14,12,15,12],[15,7,16,8],[15,19,16,20],[5,15,5,21],[8,0,8,5],[8,6,8,10],[8,12,8,17],[8,18,8,22],[10,0,11,0],[10,12,11,12],[5,2,5,10]]}
[]
[{"$f":"Select!$C$12","v":"ÖM Indoor 2019"},null,null,null,null,null,null,null,null,null,null,null,"Mannschaft:",null,null,{"$f":"MR16_Baum!$C$3","v":"RM_1"}]
["Veranstaltung"]
[{"$f":"Select!$C$13","v":"09.-10. Februar 2019"},null,null,null,null,null,null,null,null,null,null,null,"Schützen:",null,null,{"$f":"MR16_Baum!$C$4","v":"Schütze1_RM1 Schütze2_RM1"}]
["Datum"]
["Bewerb:",null,{"$f":"Select!$C$14","v":"Mannschaftsbewerb"},null,null,null,null,null,null,null,null,null,"Bogenklasse:",null,null,{"$f":"Select!$C$18","v":"Instinktivbogen Herren"}]
[]
[]
["1/8 Elimination",null,null,null,null,null,{"$f":"MR16_Baum!$C$55","v":"Scheibe: 31"},null,null,null,null,null,"1/4 Finale",null,null,null,null,null,{"$f":"MR16_Baum!$G$55","v":"Scheibe: 21"}]
[null,1,2,"Summe","Punkte","Gesamt",null,null,null,null,null,null,null,1,2,"Summe","Punkte","Gesamt"]
[1,null,null,null,null,null,null,null,null,null,null,null,1]
[]
[2,null,null,null,null,null,null,null,null,null,null,null,2]
[]
[3,null,null,null,null,null,null,null,null,null,null,null,3]
[]
["wenn erforderlich",null,null,null,null,null,null,null,null,null,null,null,"wenn erforderlich"]
[4,null,null,null,null,null,null,null,null,null,null,null,4]
[]
["Stechen wenn erforderlich",null,null,null,null,null,null,null,null,null,null,null,"Stechen wenn erforderlich"]
[null,null,null,null,null,null,null,null,"gewonnen",null,null,null,null,null,null,null,null,null,null,null,"gewonnen"]
[null,null,null,null,null,null,null,null,"verloren",null,null,null,null,null,null,null,null,null,null,null,"verloren"]
[]
[null,"Schreiber:",null,null,null,null,null,"Kontrolle:",null,null,null,null,null,"Schreiber:",null,null,null,null,null,"Kontrolle:"]
[]
[]
["1/2 Finale",null,null,null,null,null,{"$f":"MR16_Baum!$K$55","v":"Scheibe: 11"},null,null,null,null,null,"1./2. od. 3./4. Platz",null,null,null,null,null,"Scheibe:"]
[null,1,2,"Summe","Punkte","Gesamt",null,null,null,null,null,null,null,1,2,"Summe","Punkte","Gesamt"]
[1,null,null,null,null,null,null,null,null,null,null,null,1]
[]
[2,null,null,null,null,null,null,null,null,null,null,null,2]
[]
[3,null,null,null,null,null,null,null,null,null,null,null,3]
[]
["wenn erforderlich",null,null,null,null,null,null,null,null,null,null,null,"wenn erforderlich"]
[4,null,null,null,null,null,null,null,null,null,null,null,4]
[]
["Stechen wenn erforderlich",null,null,null,null,null,null,null,null,null,null,null,"Stechen wenn erforderlich"]
[null,null,null,null,null,null,null,null,"gewonnen",null,null,null,null,null,null,null,null,null,null,null,"gewonnen"]
[null,null,null,null,null,null,null,null,"verloren",null,null,null,null,null,null,null,null,null,null,null,"verloren"]
[]
[null,"Schreiber:",null,null,null,null,null,"Kontrolle:",null,null,null,null,null,"Schreiber:",null,null,null,null,null,"Kontrolle:"]
[]
[]
[]
[{"$f":"Select!$C$12","v":"ÖM Indoor 2019"},null,null,null,null,null,null,null,null,null,null,null,"Mannschaft:",null,null,{"$f":"MR16_Baum!$C$5","v":"RM_16"}]
["Veranstaltung"]
[{"$f":"Select!$C$13","v":"09.-10. Februar 2019"},null,null,null,null,null,null,null,null,null,null,null,"Schützen:",null,null,{"$f":"MR16_Baum!$C$6","v":"Schütze1_RM16  Schütze2_RM16"}]
["Datum"]
["Bewerb:",null,{"$f":"Select!$C$14","v":"Mannschaftsbewerb"},null,null,null,null,null,null,null,null,null,"Bogenklasse:",null,null,{"$f":"Select!$C$18","v":"Instinktivbogen Herren"}]
[]
[]
["1/8 Elimination",null,null,null,null,null,{"$f":"MR16_Baum!$C$56","v":"Scheibe: 32"},null,null,null,null,null,"1/4 Finale",null,null,null,null,null,{"$f":"MR16_Baum!$G$55","v":"Scheibe: 21"}]
[null,1,2,"Summe","Punkte","Gesamt",null,null,null,null,null,null,null,1,2,"Summe","Punkte","Gesamt"]
[1,null,null,null,null,null,null,null,null,null,null,null,1]
[]
[2,null,null,null,null,null,null,null,null,null,null,null,2]
[]
[3,null,null,null,null,null,null,null,null,null,null,null,3]
[]
["wenn erforderlich",null,null,null,null,null,null,null,null,null,null,null,"wenn erforderlich"]
[4,null,null,null,null,null,null,null,null,null,null,null,4]
[]
["Stechen wenn erforderlich",null,null,null,null,null,null,null,null,null,null,null,"Stechen wenn erforderlich"]
[null,null,null,null,null,null,null,null,"gewonnen",null,null,null,null,null,null,null,null,null,null,null,"gewonnen"]
[null,null,null,null,null,null,null,null,"verloren",null,null,null,null,null,null,null,null,null,null,null,"verloren"]
[]
[null,"Schreiber:",null,null,null,null,null,"Kontrolle:",null,null,null,null,null,"Schreiber:",null,null,null,null,null,"Kontrolle:"]
[]
[]
["1/2 Finale",null,null,null,null,null,{"$f":"MR16_Baum!$K$55","v":"Scheibe: 11"},null,null,null,null,null,"1./2. od. 3./4. Platz",null,null,null,null,null,"Scheibe:"]
[null,1,2,"Summe","Punkte","Gesamt",null,null,null,null,null,null,null,1,2,"Summe","Punkte","Gesamt"]
[1,null,null,null,null,null,null,null,null,null,null,null,1]
[]
[2,null,null,null,null,null,null,null,null,null,null,null,2]
[]
[3,null,null,null,null,null,null,null,null,null,null,null,3]
[]
["wenn erforderlich",null,null,null,null,null,null,null,null,null,null,null,"wenn erforderlich"]
[4,null,null,null,null,null,null,null,null,null,null,null,4]
[]
["Stechen wenn erforderlich",null,null,null,null,null,null,null,null,null,null,null,"Stechen wenn erforderlich"]
[null,null,null,null,null,null,null,null,"gewonnen",null,null,null,null,null,null,null,null,null,null,null,"gewonnen"]
[null,null,null,null,null,null,null,null,"verloren",null,null,null,null,null,null,null,null,null,null,null,"verloren"]
[]
[null,"Schreiber:",null,null,null,null,null,"Kontrolle:",null,null,null,null,null,"Schreiber:",null,null,null,null,null,"Kontrolle:"]
[]
[]
[]
[{"$f":"Select!$C$12","v":"ÖM Indoor 2019"},null,null,null,null,null,null,null,null,null,null,null,"Mannschaft:",null,null,{"$f":"MR16_Baum!$C$9","v":"RM_9"}]
["Veranstaltung"]
[{"$f":"Select!$C$13","v":"09.-10. Februar 2019"},null,null,null,null,null,null,null,null,null,null,null,"Schützen:",null,null,{"$f":"MR16_Baum!$C$10","v":"Schütze1_RM9 Schütze2_RM9"}]
["Datum"]
["Bewerb:",null,{"$f":"Select!$C$14","v":"Mannschaftsbewerb"},null,null,null,null,null,null,null,null,null,"Bogenklasse:",null,null,{"$f":"Select!$C$18","v":"Instinktivbogen Herren"}]
[]
[]
["1/8 Elimination",null,null,null,null,null,{"$f":"MR16_Baum!$C$57","v":"Scheibe: 33"},null,null,null,null,null,"1/4 Finale",null,null,null,null,null,{"$f":"MR16_Baum!$G$56","v":"Scheibe: 22"}]
[null,1,2,"Summe","Punkte","Gesamt",null,null,null,null,null,null,null,1,2,"Summe","Punkte","Gesamt"]
[1,null,null,null,null,null,null,null,null,null,null,null,1]
[]
[2,null,null,null,null,null,null,null,null,null,null,null,2]
[]
[3,null,null,null,null,null,null,null,null,null,null,null,3]
[]
["wenn erforderlich",null,null,null,null,null,null,null,null,null,null,null,"wenn erforderlich"]
[4,null,null,null,null,null,null,null,null,null,null,null,4]
[]
["Stechen wenn erforderlich",null,null,null,null,null,null,null,null,null,null,null,"Stechen wenn erforderlich"]
[null,null,null,null,null,null,null,null,"gewonnen",null,null,null,null,null,null,null,null,null,null,null,"gewonnen"]
[null,null,null,null,null,null,null,null,"verloren",null,null,null,null,null,null,null,null,null,null,null,"verloren"]
[]
[null,"Schreiber:",null,null,null,null,null,"Kontrolle:",null,null,null,null,null,"Schreiber:",null,null,null,null,null,"Kontrolle:"]
[]
[]
["1/2 Finale",null,null,null,null,null,{"$f":"MR16_Baum!$K$55","v":"Scheibe: 11"},null,null,null,null,null,"1./2. od. 3./4. Platz",null,null,null,null,null,"Scheibe:"]
[null,1,2,"Summe","Punkte","Gesamt",null,null,null,null,null,null,null,1,2,"Summe","Punkte","Gesamt"]
[1,null,null,null,null,null,null,null,null,null,null,null,1]
[]
[2,null,null,null,null,null,null,null,null,null,null,null,2]
[]
[3,null,null,null,null,null,null,null,null,null,null,null,3]
[]
["wenn erforderlich",null,null,null,null,null,null,null,null,null,null,null,"wenn erforderlich"]
[4,null,null,null,null,null,null,null,null,null,null,null,4]
[]
["Stechen wenn erforderlich",null,null,null,null,null,null,null,null,null,null,null,"Stechen wenn erforderlich"]
[null,null,null,null,null,null,null,null,"gewonnen",null,null,null,null,null,null,null,null,null,null,null,"gewonnen"]
[null,null,null,null,null,null,null,null,"verloren",null,null,null,null,null,null,null,null,null,null,null,"verloren"]
[]
[null,"Schreiber:",null,null,null,null,null,"Kontrolle:",null,null,null,null,null,"Schreiber:",null,null,null,null,null,"Kontrolle:"]
[]
[]
[]
[{"$f":"Select!$C$12","v":"ÖM Indoor 2019"},null,null,null,null,null,null,null,null,null,null,null,"Mannschaft:",null,null,{"$f":"MR16_Baum!$C$11","v":"RM_8"}]
["Veranstaltung"]
[{"$f":"Select!$C$13","v":"09.-10. Februar 2019"},null,null,null,null,null,null,null,null,null,null,null,"Schützen:",null,null,{"$f":"MR16_Baum!$C$12","v":"Schütze1_RM8 Schütze2_RM8"}]
["Datum"]
["Bewerb:",null,{"$f":"Select!$C$14","v":"Mannschaftsbewerb"},null,null,null,null,null,null,null,null,null,"Bogenklasse:",null,null,{"$f":"Select!$C$18","v":"Instinktivbogen Herren"}]
[]
[]
["1/8 Elimination",null,null,null,null,null,{"$f":"MR16_Baum!$C$58","v":"Scheibe: 34"},null,null,null,null,null,"1/4 Finale",null,null,null,null,null,{"$f":"MR16_Baum!$G$56","v":"Scheibe: 22"}]
[null,1,2,"Summe","Punkte","Gesamt",null,null,null,null,null,null,null,1,2,"Summe","Punkte","Gesamt"]
[1,null,null,null,null,null,null,null,null,null,null,null,1]
[]
[2,null,null,null,null,null,null,null,null,null,null,null,2]
[]
[3,null,null,null,null,null,null,null,null,null,null,null,3]
[]
["wenn erforderlich",null,null,null,null,null,null,null,null,null,null,null,"wenn erforderlich"]
[4,null,null,null,null,null,null,null,null,null,null,null,4]
[]
["Stechen wenn erforderlich",null,null,null,null,null,null,null,null,null,null,null,"Stechen wenn erforderlich"]
[null,null,null,null,null,null,null,null,"gewonnen",null,null,null,null,null,null,null,null,null,null,null,"gewonnen"]
[null,null,null,null,null,null,null,null,"verloren",null,null,null,null,null,null,null,null,null,null,null,"verloren"]
[]
[null,"Schreiber:",null,null,null,null,null,"Kontrolle:",null,null,null,null,null,"Schreiber:",null,null,null,null,null,"Kontrolle:"]
[]
[]
["1/2 Finale",null,null,null,null,null,{"$f":"MR16_Baum!$K$55","v":"Scheibe: 11"},null,null,null,null,null,"1./2. od. 3./4. Platz",null,null,null,null,null,"Scheibe:"]
[null,1,2,"Summe","Punkte","Gesamt",null,null,null,null,null,null,null,1,2,"Summe","Punkte","Gesamt"]
[1,null,null,null,null,null,null,null,null,null,null,null,1]
[]
[2,null,null,null,null,null,null,null,null,null,null,null,2]
[]
[3,null,null,null,null,null,null,null,null,null,null,null,3]
[]
["wenn erforderlich",null,null,null,null,null,null,null,null,null,null,null,"wenn erforderlich"]
[4,null,null,null,null,null,null,null,null,null,null,null,4]
[]
["Stechen wenn erforderlich",null,null,null,null,null,null,null,null,null,null,null,"Stechen wenn erforderlich"]
[null,null,null,null,null,null,null,null,"gewonnen",null,null,null,null,null,null,null,null,null,null,null,"gewonnen"]
[null,null,null,null,null,null,null,null,"verloren",null,null,null,null,null,null,null,null,null,null,null,"verloren"]
[]
[null,"Schreiber:",null,null,null,null,null,"Kontrolle:",null,null,null,null,null,"Schreiber:",null,null,null,null,null,"Kontrolle:"]
[]
[]
[]
[{"$f":"Select!$C$12","v":"ÖM Indoor 2019"},null,null,null,null,null,null,null,null,null,null,null,"Mannschaft:",null,null,{"$f":"MR16_Baum!$C$15","v":"RM_5"}]
["Veranstaltung"]
[{"$f":"Select!$C$13","v":"09.-10. Februar 2019"},null,null,null,null,null,null,null,null,null,null,null,"Schützen:",null,null,{"$f":"MR16_Baum!$C$16","v":"Schütze1_RM5 Schütze2_RM5"}]
["Datum"]
["Bewerb:",null,{"$f":"Select!$C$14","v":"Mannschaftsbewerb"},null,null,null,null,null,null,null,null,null,"Bogenklasse:",null,null,{"$f":"Select!$C$18","v":"Instinktivbogen Herren"}]
[]
[]
["1/8 Elimination",null,null,null,null,null,{"$f":"MR16_Baum!$C$59","v":"Scheibe: 35"},null,null,null,null,null,"1/4 Finale",null,null,null,null,null,{"$f":"MR16_Baum!$G$57","v":"Scheibe: 23"}]
[null,1,2,"Summe","Punkte","Gesamt",null,null,null,null,null,null,null,1,2,"Summe","Punkte","Gesamt"]
[1,null,null,null,null,null,null,null,null,null,null,null,1]
[]
[2,null,null,null,null,null,null,null,null,null,null,null,2]
[]
[3,null,null,null,null,null,null,null,null,null,null,null,3]
[]
["wenn erforderlich",null,null,null,null,null,null,null,null,null,null,null,"wenn erforderlich"]
[4,null,null,null,null,null,null,null,null,null,null,null,4]
[]
["Stechen wenn erforderlich",null,null,null,null,null,null,null,null,null,null,null,"Stechen wenn erforderlich"]
[null,null,null,null,null,null,null,null,"gewonnen",null,null,null,null,null,null,null,null,null,null,null,"gewonnen"]
[null,null,null,null,null,null,null,null,"verloren",null,null,null,null,null,null,null,null,null,null,null,"verloren"]
[]
[null,"Schreiber:",null,null,null,null,null,"Kontrolle:",null,null,null,null,null,"Schreiber:",null,null,null,null,null,"Kontrolle:"]
[]
[]
["1/2 Finale",null,null,null,null,null,{"$f":"MR16_Baum!$K$56","v":"Scheibe: 12"},null,null,null,null,null,"1./2. od. 3./4. Platz",null,null,null,null,null,"Scheibe:"]
[null,1,2,"Summe","Punkte","Gesamt",null,null,null,null,null,null,null,1,2,"Summe","Punkte","Gesamt"]
[1,null,null,null,null,null,null,null,null,null,null,null,1]
[]
[2,null,null,null,null,null,null,null,null,null,null,null,2]
[]
[3,null,null,null,null,null,null,null,null,null,null,null,3]
[]
["wenn erforderlich",null,null,null,null,null,null,null,null,null,null,null,"wenn erforderlich"]
[4,null,null,null,null,null,null,null,null,null,null,null,4]
[]
["Stechen wenn erforderlich",null,null,null,null,null,null,null,null,null,null,null,"Stechen wenn erforderlich"]
[null,null,null,null,null,null,null,null,"gewonnen",null,null,null,null,null,null,null,null,null,null,null,"gewonnen"]
[null,null,null,null,null,null,null,null,"verloren",null,null,null,null,null,null,null,null,null,null,null,"verloren"]
[]
[null,"Schreiber:",null,null,null,null,null,"Kontrolle:",null,null,null,null,null,"Schreiber:",null,null,null,null,null,"Kontrolle:"]
[]
[]
[]
[{"$f":"Select!$C$12","v":"ÖM Indoor 2019"},null,null,null,null,null,null,null,null,null,null,null,"Mannschaft:",null,null,{"$f":"MR16_Baum!$C$17","v":"RM_12"}]
["Veranstaltung"]
[{"$f":"Select!$C$13","v":"09.-10. Februar 2019"},null,null,null,null,null,null,null,null,null,null,null,"Schützen:",null,null,{"$f":"MR16_Baum!$C$18","v":"Schütze1_RM12  Schütze2_RM12"}]
["Datum"]
["Bewerb:",null,{"$f":"Select!$C$14","v":"Mannschaftsbewerb"},null,null,null,null,null,null,null,null,null,"Bogenklasse:",null,null,{"$f":"Select!$C$18","v":"Instinktivbogen Herren"}]
[]
[]
["1/8 Elimination",null,null,null,null,null,{"$f":"MR16_Baum!$C$60","v":"Scheibe: 36"},null,null,null,null,null,"1/4 Finale",null,null,null,null,null,{"$f":"MR16_Baum!$G$57","v":"Scheibe: 23"}]
[null,1,2,"Summe","Punkte","Gesamt",null,null,null,null,null,null,null,1,2,"Summe","Punkte","Gesamt"]
[1,null,null,null,null,null,null,null,null,null,null,null,1]
[]
[2,null,null,null,null,null,null,null,null,null,null,null,2]
[]
[3,null,null,null,null,null,null,null,null,null,null,null,3]
[]
["wenn erforderlich",null,null,null,null,null,null,null,null,null,null,null,"wenn erforderlich"]
[4,null,null,null,null,null,null,null,null,null,null,null,4]
[]
["Stechen wenn erforderlich",null,null,null,null,null,null,null,null,null,null,null,"Stechen wenn erforderlich"]
[null,null,null,null,null,null,null,null,"gewonnen",null,null,null,null,null,null,null,null,null,null,null,"gewonnen"]
[null,null,null,null,null,null,null,null,"verloren",null,null,null,null,null,null,null,null,null,null,null,"verloren"]
[]
[null,"Schreiber:",null,null,null,null,null,"Kontrolle:",null,null,null,null,null,"Schreiber:",null,null,null,null,null,"Kontrolle:"]
[]
[]
["1/2 Finale",null,null,null,null,null,{"$f":"MR16_Baum!$K$56","v":"Scheibe: 12"},null,null,null,null,null,"1./2. od. 3./4. Platz",null,null,null,null,null,"Scheibe:"]
[null,1,2,"Summe","Punkte","Gesamt",null,null,null,null,null,null,null,1,2,"Summe","Punkte","Gesamt"]
[1,null,null,null,null,null,null,null,null,null,null,null,1]
[]
[2,null,null,null,null,null,null,null,null,null,null,null,2]
[]
[3,null,null,null,null,null,null,null,null,null,null,null,3]
[]
["wenn erforderlich",null,null,null,null,null,null,null,null,null,null,null,"wenn erforderlich"]
[4,null,null,null,null,null,null,null,null,null,null,null,4]
[]
["Stechen wenn erforderlich",null,null,null,null,null,null,null,null,null,null,null,"Stechen wenn erforderlich"]
[null,null,null,null,null,null,null,null,"gewonnen",null,null,null,null,null,null,null,null,null,null,null,"gewonnen"]
[null,null,null,null,null,null,null,null,"verloren",null,null,null,null,null,null,null,null,null,null,null,"verloren"]
[]
[null,"Schreiber:",null,null,null,null,null,"Kontrolle:",null,null,null,null,null,"Schreiber:",null,null,null,null,null,"Kontrolle:"]
[]
[]
[]
[{"$f":"Select!$C$12","v":"ÖM Indoor 2019"},null,null,null,null,null,null,null,null,null,null,null,"Mannschaft:",null,null,{"$f":"MR16_Baum!$C$21","v":"RM_13"}]
["Veranstaltung"]
[{"$f":"Select!$C$13","v":"09.-10. Februar 2019"},null,null,null,null,null,null,null,null,null,null,null,"Schützen:",null,null,{"$f":"MR16_Baum!$C$22","v":"Schütze1_RM13  Schütze2_RM13 "}]
["Datum"]
["Bewerb:",null,{"$f":"Select!$C$14","v":"Mannschaftsbewerb"},null,null,null,null,null,null,null,null,null,"Bogenklasse:",null,null,{"$f":"Select!$C$18","v":"Instinktivbogen Herren"}]
[]
[]
["1/8 Elimination",null,null,null,null,null,{"$f":"MR16_Baum!$C$61","v":"Scheibe: 37"},null,null,null,null,null,"1/4 Finale",null,null,null,null,null,{"$f":"MR16_Baum!$G$58","v":"Scheibe: 24"}]
[null,1,2,"Summe","Punkte","Gesamt",null,null,null,null,null,null,null,1,2,"Summe","Punkte","Gesamt"]
[1,null,null,null,null,null,null,null,null,null,null,null,1]
[]
[2,null,null,null,null,null,null,null,null,null,null,null,2]
[]
[3,null,null,null,null,null,null,null,null,null,null,null,3]
[]
["wenn erforderlich",null,null,null,null,null,null,null,null,null,null,null,"wenn erforderlich"]
[4,null,null,null,null,null,null,null,null,null,null,null,4]
[]
["Stechen wenn erforderlich",null,null,null,null,null,null,null,null,null,null,null,"Stechen wenn erforderlich"]
[null,null,null,null,null,null,null,null,"gewonnen",null,null,null,null,null,null,null,null,null,null,null,"gewonnen"]
[null,null,null,null,null,null,null,null,"verloren",null,null,null,null,null,null,null,null,null,null,null,"verloren"]
[]
[null,"Schreiber:",null,null,null,null,null,"Kontrolle:",null,null,null,null,null,"Schreiber:",null,null,null,null,null,"Kontrolle:"]
[]
[]
["1/2 Finale",null,null,null,null,null,{"$f":"MR16_Baum!$K$56","v":"Scheibe: 12"},null,null,null,null,null,"1./2. od. 3./4. Platz",null,null,null,null,null,"Scheibe:"]
[null,1,2,"Summe","Punkte","Gesamt",null,null,null,null,null,null,null,1,2,"Summe","Punkte","Gesamt"]
[1,null,null,null,null,null,null,null,null,null,null,null,1]
[]
[2,null,null,null,null,null,null,null,null,null,null,null,2]
[]
[3,null,null,null,null,null,null,null,null,null,null,null,3]
[]
["wenn erforderlich",null,null,null,null,null,null,null,null,null,null,null,"wenn erforderlich"]
[4,null,null,null,null,null,null,null,null,null,null,null,4]
[]
["Stechen wenn erforderlich",null,null,null,null,null,null,null,null,null,null,null,"Stechen wenn erforderlich"]
[null,null,null,null,null,null,null,null,"gewonnen",null,null,null,null,null,null,null,null,null,null,null,"gewonnen"]
[null,null,null,null,null,null,null,null,"verloren",null,null,null,null,null,null,null,null,null,null,null,"verloren"]
[]
[null,"Schreiber:",null,null,null,null,null,"Kontrolle:",null,null,null,null,null,"Schreiber:",null,null,null,null,null,"Kontrolle:"]
[]
[]
[]
[{"$f":"Select!$C$12","v":"ÖM Indoor 2019"},null,null,null,null,null,null,null,null,null,null,null,"Mannschaft:",null,null,{"$f":"MR16_Baum!$C$23","v":"RM_4"}]
["Veranstaltung"]
[{"$f":"Select!$C$13","v":"09.-10. Februar 2019"},null,null,null,null,null,null,null,null,null,null,null,"Schützen:",null,null,{"$f":"MR16_Baum!$C$24","v":"Schütze1_RM4 Schütze2_RM4"}]
["Datum"]
["Bewerb:",null,{"$f":"Select!$C$14","v":"Mannschaftsbewerb"},null,null,null,null,null,null,null,null,null,"Bogenklasse:",null,null,{"$f":"Select!$C$18","v":"Instinktivbogen Herren"}]
[]
[]
["1/8 Elimination",null,null,null,null,null,{"$f":"MR16_Baum!$C$62","v":"Scheibe: 38"},null,null,null,null,null,"1/4 Finale",null,null,null,null,null,{"$f":"MR16_Baum!$G$58","v":"Scheibe: 24"}]
[null,1,2,"Summe","Punkte","Gesamt",null,null,null,null,null,null,null,1,2,"Summe","Punkte","Gesamt"]
[1,null,null,null,null,null,null,null,null,null,null,null,1]
[]
[2,null,null,null,null,null,null,null,null,null,null,null,2]
[]
[3,null,null,null,null,null,null,null,null,null,null,null,3]
[]
["wenn erforderlich",null,null,null,null,null,null,null,null,null,null,null,"wenn erforderlich"]
[4,null,null,null,null,null,null,null,null,null,null,null,4]
[]
["Stechen wenn erforderlich",null,null,null,null,null,null,null,null,null,null,null,"Stechen wenn erforderlich"]
[null,null,null,null,null,null,null,null,"gewonnen",null,null,null,null,null,null,null,null,null,null,null,"gewonnen"]
[null,null,null,null,null,null,null,null,"verloren",null,null,null,null,null,null,null,null,null,null,null,"verloren"]
[]
[null,"Schreiber:",null,null,null,null,null,"Kontrolle:",null,null,null,null,null,"Schreiber:",null,null,null,null,null,"Kontrolle:"]
[]
[]
["1/2 Finale",null,null,null,null,null,{"$f":"MR16_Baum!$K$56","v":"Scheibe: 12"},null,null,null,null,null,"1./2. od. 3./4. Platz",null,null,null,null,null,"Scheibe:"]
[null,1,2,"Summe","Punkte","Gesamt",null,null,null,null,null,null,null,1,2,"Summe","Punkte","Gesamt"]
[1,null,null,null,null,null,null,null,null,null,null,null,1]
[]
[2,null,null,null,null,null,null,null,null,null,null,null,2]
[]
[3,null,null,null,null,null,null,null,null,null,null,null,3]
[]
["wenn erforderlich",null,null,null,null,null,null,null,null,null,null,null,"wenn erforderlich"]
[4,null,null,null,null,null,null,null,null,null,null,null,4]
[]
["Stechen wenn erforderlich",null,null,null,null,null,null,null,null,null,null,null,"Stechen wenn erforderlich"]
[null,null,null,null,null,null,null,null,"gewonnen",null,null,null,null,null,null,null,null,null,null,null,"gewonnen"]
[null,null,null,null,null,null,null,null,"verloren",null,null,null,null,null,null,null,null,null,null,null,"verloren"]
[]
[null,"Schreiber:",null,null,null,null,null,"Kontrolle:",null,null,null,null,null,"Schreiber:",null,null,null,null,null,"Kontrolle:"]
[]
[]
[]
[{"$f":"Select!$C$12","v":"ÖM Indoor 2019"},null,null,null,null,null,null,null,null,null,null,null,"Mannschaft:",null,null,{"$f":"MR16_Baum!$C$27","v":"RM_3"}]
["Veranstaltung"]
[{"$f":"Select!$C$13","v":"09.-10. Februar 2019"},null,null,null,null,null,null,null,null,null,null,null,"Schützen:",null,null,{"$f":"MR16_Baum!$C$28","v":"Schütze1_RM3 Schütze2_RM3"}]
["Datum"]
["Bewerb:",null,{"$f":"Select!$C$14","v":"Mannschaftsbewerb"},null,null,null,null,null,null,null,null,null,"Bogenklasse:",null,null,{"$f":"Select!$C$18","v":"Instinktivbogen Herren"}]
[]
[]
["1/8 Elimination",null,null,null,null,null,{"$f":"MR16_Baum!$C$63","v":"Scheibe: 39"},null,null,null,null,null,"1/4 Finale",null,null,null,null,null,{"$f":"MR16_Baum!$G$59","v":"Scheibe: 25"}]
[null,1,2,"Summe","Punkte","Gesamt",null,null,null,null,null,null,null,1,2,"Summe","Punkte","Gesamt"]
[1,null,null,null,null,null,null,null,null,null,null,null,1]
[]
[2,null,null,null,null,null,null,null,null,null,null,null,2]
[]
[3,null,null,null,null,null,null,null,null,null,null,null,3]
[]
["wenn erforderlich",null,null,null,null,null,null,null,null,null,null,null,"wenn erforderlich"]
[4,null,null,null,null,null,null,null,null,null,null,null,4]
[]
["Stechen wenn erforderlich",null,null,null,null,null,null,null,null,null,null,null,"Stechen wenn erforderlich"]
[null,null,null,null,null,null,null,null,"gewonnen",null,null,null,null,null,null,null,null,null,null,null,"gewonnen"]
[null,null,null,null,null,null,null,null,"verloren",null,null,null,null,null,null,null,null,null,null,null,"verloren"]
[]
[null,"Schreiber:",null,null,null,null,null,"Kontrolle:",null,null,null,null,null,"Schreiber:",null,null,null,null,null,"Kontrolle:"]
[]
[]
["1/2 Finale",null,null,null,null,null,{"$f":"MR16_Baum!$K$57","v":"Scheibe: 13"},null,null,null,null,null,"1./2. od. 3./4. Platz",null,null,null,null,null,"Scheibe:"]
[null,1,2,"Summe","Punkte","Gesamt",null,null,null,null,null,null,null,1,2,"Summe","Punkte","Gesamt"]
[1,null,null,null,null,null,null,null,null,null,null,null,1]
[]
[2,null,null,null,null,null,null,null,null,null,null,null,2]
[]
[3,null,null,null,null,null,null,null,null,null,null,null,3]
[]
["wenn erforderlich",null,null,null,null,null,null,null,null,null,null,null,"wenn erforderlich"]
[4,null,null,null,null,null,null,null,null,null,null,null,4]
[]
["Stechen wenn erforderlich",null,null,null,null,null,null,null,null,null,null,null,"Stechen wenn erforderlich"]
[null,null,null,null,null,null,null,null,"gewonnen",null,null,null,null,null,null,null,null,null,null,null,"gewonnen"]
[null,null,null,null,null,null,null,null,"verloren",null,null,null,null,null,null,null,null,null,null,null,"verloren"]
[]
[null,"Schreiber:",null,null,null,null,null,"Kontrolle:",null,null,null,null,null,"Schreiber:",null,null,null,null,null,"Kontrolle:"]
[]
[]
[]
[{"$f":"Select!$C$12","v":"ÖM Indoor 2019"},null,null,null,null,null,null,null,null,null,null,null,"Mannschaft:",null,null,{"$f":"MR16_Baum!$C$29","v":"RM_14"}]
["Veranstaltung"]
[{"$f":"Select!$C$13","v":"09.-10. Februar 2019"},null,null,null,null,null,null,null,null,null,null,null,"Schützen:",null,null,{"$f":"MR16_Baum!$C$30","v":"Schütze1_RM14 Schütze2_RM14 "}]
["Datum"]
["Bewerb:",null,{"$f":"Select!$C$14","v":"Mannschaftsbewerb"},null,null,null,null,null,null,null,null,null,"Bogenklasse:",null,null,{"$f":"Select!$C$18","v":"Instinktivbogen Herren"}]
[]
[]
["1/8 Elimination",null,null,null,null,null,{"$f":"MR16_Baum!$C$64","v":"Scheibe: 40"},null,null,null,null,null,"1/4 Finale",null,null,null,null,null,{"$f":"MR16_Baum!$G$59","v":"Scheibe: 25"}]
[null,1,2,"Summe","Punkte","Gesamt",null,null,null,null,null,null,null,1,2,"Summe","Punkte","Gesamt"]
[1,null,null,null,null,null,null,null,null,null,null,null,1]
[]
[2,null,null,null,null,null,null,null,null,null,null,null,2]
[]
[3,null,null,null,null,null,null,null,null,null,null,null,3]
[]
["wenn erforderlich",null,null,null,null,null,null,null,null,null,null,null,"wenn erforderlich"]
[4,null,null,null,null,null,null,null,null,null,null,null,4]
[]
["Stechen wenn erforderlich",null,null,null,null,null,null,null,null,null,null,null,"Stechen wenn erforderlich"]
[null,null,null,null,null,null,null,null,"gewonnen",null,null,null,null,null,null,null,null,null,null,null,"gewonnen"]
[null,null,null,null,null,null,null,null,"verloren",null,null,null,null,null,null,null,null,null,null,null,"verloren"]
[]
[null,"Schreiber:",null,null,null,null,null,"Kontrolle:",null,null,null,null,null,"Schreiber:",null,null,null,null,null,"Kontrolle:"]
[]
[]
["1/2 Finale",null,null,null,null,null,{"$f":"MR16_Baum!$K$57","v":"Scheibe: 13"},null,null,null,null,null,"1./2. od. 3./4. Platz",null,null,null,null,null,"Scheibe:"]
[null,1,2,"Summe","Punkte","Gesamt",null,null,null,null,null,null,null,1,2,"Summe","Punkte","Gesamt"]
[1,null,null,null,null,null,null,null,null,null,null,null,1]
[]
[2,null,null,null,null,null,null,null,null,null,null,null,2]
[]
[3,null,null,null,null,null,null,null,null,null,null,null,3]
[]
["wenn erforderlich",null,null,null,null,null,null,null,null,null,null,null,"wenn erforderlich"]
[4,null,null,null,null,null,null,null,null,null,null,null,4]
[]
["Stechen wenn erforderlich",null,null,null,null,null,null,null,null,null,null,null,"Stechen wenn erforderlich"]
[null,null,null,null,null,null,null,null,"gewonnen",null,null,null,null,null,null,null,null,null,null,null,"gewonnen"]
[null,null,null,null,null,null,null,null,"verloren",null,null,null,null,null,null,null,null,null,null,null,"verloren"]
[]
[null,"Schreiber:",null,null,null,null,null,"Kontrolle:",null,null,null,null,null,"Schreiber:",null,null,null,null,null,"Kontrolle:"]
[]
[]
[]
[{"$f":"Select!$C$12","v":"ÖM Indoor 2019"},null,null,null,null,null,null,null,null,null,null,null,"Mannschaft:",null,null,{"$f":"MR16_Baum!$C$33","v":"RM_11"}]
["Veranstaltung"]
[{"$f":"Select!$C$13","v":"09.-10. Februar 2019"},null,null,null,null,null,null,null,null,null,null,null,"Schützen:",null,null,{"$f":"MR16_Baum!$C$34","v":"Schütze1_RM11 Schütze2_RM11"}]
["Datum"]
["Bewerb:",null,{"$f":"Select!$C$14","v":"Mannschaftsbewerb"},null,null,null,null,null,null,null,null,null,"Bogenklasse:",null,null,{"$f":"Select!$C$18","v":"Instinktivbogen Herren"}]
[]
[]
["1/8 Elimination",null,null,null,null,null,{"$f":"MR16_Baum!$C$65","v":"Scheibe: 41"},null,null,null,null,null,"1/4 Finale",null,null,null,null,null,{"$f":"MR16_Baum!$G$60","v":"Scheibe: 26"}]
[null,1,2,"Summe","Punkte","Gesamt",null,null,null,null,null,null,null,1,2,"Summe","Punkte","Gesamt"]
[1,null,null,null,null,null,null,null,null,null,null,null,1]
[]
[2,null,null,null,null,null,null,null,null,null,null,null,2]
[]
[3,null,null,null,null,null,null,null,null,null,null,null,3]
[]
["wenn erforderlich",null,null,null,null,null,null,null,null,null,null,null,"wenn erforderlich"]
[4,null,null,null,null,null,null,null,null,null,null,null,4]
[]
["Stechen wenn erforderlich",null,null,null,null,null,null,null,null,null,null,null,"Stechen wenn erforderlich"]
[null,null,null,null,null,null,null,null,"gewonnen",null,null,null,null,null,null,null,null,null,null,null,"gewonnen"]
[null,null,null,null,null,null,null,null,"verloren",null,null,null,null,null,null,null,null,null,null,null,"verloren"]
[]
[null,"Schreiber:",null,null,null,null,null,"Kontrolle:",null,null,null,null,null,"Schreiber:",null,null,null,null,null,"Kontrolle:"]
[]
[]
["1/2 Finale",null,null,null,null,null,{"$f":"MR16_Baum!$K$57","v":"Scheibe: 13"},null,null,null,null,null,"1./2. od. 3./4. Platz",null,null,null,null,null,"Scheibe:"]
[null,1,2,"Summe","Punkte","Gesamt",null,null,null,null,null,null,null,1,2,"Summe","Punkte","Gesamt"]
[1,null,null,null,null,null,null,null,null,null,null,null,1]
[]
[2,null,null,null,null,null,null,null,null,null,null,null,2]
[]
[3,null,null,null,null,null,null,null,null,null,null,null,3]
[]
["wenn erforderlich",null,null,null,null,null,null,null,null,null,null,null,"wenn erforderlich"]
[4,null,null,null,null,null,null,null,null,null,null,null,4]
[]
["Stechen wenn erforderlich",null,null,null,null,null,null,null,null,null,null,null,"Stechen wenn erforderlich"]
[null,null,null,null,null,null,null,null,"gewonnen",null,null,null,null,null,null,null,null,null,null,null,"gewonnen"]
[null,null,null,null,null,null,null,null,"verloren",null,null,null,null,null,null,null,null,null,null,null,"verloren"]
[]
[null,"Schreiber:",null,null,null,null,null,"Kontrolle:",null,null,null,null,null,"Schreiber:",null,null,null,null,null,"Kontrolle:"]
[]
[]
[]
[{"$f":"Select!$C$12","v":"ÖM Indoor 2019"},null,null,null,null,null,null,null,null,null,null,null,"Mannschaft:",null,null,{"$f":"MR16_Baum!$C$35","v":"RM_6"}]
["Veranstaltung"]
[{"$f":"Select!$C$13","v":"09.-10. Februar 2019"},null,null,null,null,null,null,null,null,null,null,null,"Schützen:",null,null,{"$f":"MR16_Baum!$C$36","v":"Schütze1_RM6 Schütze2_RM6"}]
["Datum"]
["Bewerb:",null,{"$f":"Select!$C$14","v":"Mannschaftsbewerb"},null,null,null,null,null,null,null,null,null,"Bogenklasse:",null,null,{"$f":"Select!$C$18","v":"Instinktivbogen Herren"}]
[]
[]
["1/8 Elimination",null,null,null,null,null,{"$f":"MR16_Baum!$C$66","v":"Scheibe: 42"},null,null,null,null,null,"1/4 Finale",null,null,null,null,null,{"$f":"MR16_Baum!$G$60","v":"Scheibe: 26"}]
[null,1,2,"Summe","Punkte","Gesamt",null,null,null,null,null,null,null,1,2,"Summe","Punkte","Gesamt"]
[1,null,null,null,null,null,null,null,null,null,null,null,1]
[]
[2,null,null,null,null,null,null,null,null,null,null,null,2]
[]
[3,null,null,null,null,null,null,null,null,null,null,null,3]
[]
["wenn erforderlich",null,null,null,null,null,null,null,null,null,null,null,"wenn erforderlich"]
[4,null,null,null,null,null,null,null,null,null,null,null,4]
[]
["Stechen wenn erforderlich",null,null,null,null,null,null,null,null,null,null,null,"Stechen wenn erforderlich"]
[null,null,null,null,null,null,null,null,"gewonnen",null,null,null,null,null,null,null,null,null,null,null,"gewonnen"]
[null,null,null,null,null,null,null,null,"verloren",null,null,null,null,null,null,null,null,null,null,null,"verloren"]
[]
[null,"Schreiber:",null,null,null,null,null,"Kontrolle:",null,null,null,null,null,"Schreiber:",null,null,null,null,null,"Kontrolle:"]
[]
[]
["1/2 Finale",null,null,null,null,null,{"$f":"MR16_Baum!$K$57","v":"Scheibe: 13"},null,null,null,null,null,"1./2. od. 3./4. Platz",null,null,null,null,null,"Scheibe:"]
[null,1,2,"Summe","Punkte","Gesamt",null,null,null,null,null,null,null,1,2,"Summe","Punkte","Gesamt"]
[1,null,null,null,null,null,null,null,null,null,null,null,1]
[]
[2,null,null,null,null,null,null,null,null,null,null,null,2]
[]
[3,null,null,null,null,null,null,null,null,null,null,null,3]
[]
["wenn erforderlich",null,null,null,null,null,null,null,null,null,null,null,"wenn erforderlich"]
[4,null,null,null,null,null,null,null,null,null,null,null,4]
[]
["Stechen wenn erforderlich",null,null,null,null,null,null,null,null,null,null,null,"Stechen wenn erforderlich"]
[null,null,null,null,null,null,null,null,"gewonnen",null,null,null,null,null,null,null,null,null,null,null,"gewonnen"]
[null,null,null,null,null,null,null,null,"verloren",null,null,null,null,null,null,null,null,null,null,null,"verloren"]
[]
[null,"Schreiber:",null,null,null,null,null,"Kontrolle:",null,null,null,null,null,"Schreiber:",null,null,null,null,null,"Kontrolle:"]
[]
[]
[]
[{"$f":"Select!$C$12","v":"ÖM Indoor 2019"},null,null,null,null,null,null,null,null,null,null,null,"Mannschaft:",null,null,{"$f":"MR16_Baum!$C$39","v":"RM_7"}]
["Veranstaltung"]
[{"$f":"Select!$C$13","v":"09.-10. Februar 2019"},null,null,null,null,null,null,null,null,null,null,null,"Schützen:",null,null,{"$f":"MR16_Baum!$C$40","v":"Schütze1_RM7 Schütze2_RM7"}]
["Datum"]
["Bewerb:",null,{"$f":"Select!$C$14","v":"Mannschaftsbewerb"},null,null,null,null,null,null,null,null,null,"Bogenklasse:",null,null,{"$f":"Select!$C$18","v":"Instinktivbogen Herren"}]
[]
[]
["1/8 Elimination",null,null,null,null,null,{"$f":"MR16_Baum!$C$67","v":"Scheibe: 43"},null,null,null,null,null,"1/4 Finale",null,null,null,null,null,{"$f":"MR16_Baum!$G$61","v":"Scheibe: 27"}]
[null,1,2,"Summe","Punkte","Gesamt",null,null,null,null,null,null,null,1,2,"Summe","Punkte","Gesamt"]
[1,null,null,null,null,null,null,null,null,null,null,null,1]
[]
[2,null,null,null,null,null,null,null,null,null,null,null,2]
[]
[3,null,null,null,null,null,null,null,null,null,null,null,3]
[]
["wenn erforderlich",null,null,null,null,null,null,null,null,null,null,null,"wenn erforderlich"]
[4,null,null,null,null,null,null,null,null,null,null,null,4]
[]
["Stechen wenn erforderlich",null,null,null,null,null,null,null,null,null,null,null,"Stechen wenn erforderlich"]
[null,null,null,null,null,null,null,null,"gewonnen",null,null,null,null,null,null,null,null,null,null,null,"gewonnen"]
[null,null,null,null,null,null,null,null,"verloren",null,null,null,null,null,null,null,null,null,null,null,"verloren"]
[]
[null,"Schreiber:",null,null,null,null,null,"Kontrolle:",null,null,null,null,null,"Schreiber:",null,null,null,null,null,"Kontrolle:"]
[]
[]
["1/2 Finale",null,null,null,null,null,{"$f":"MR16_Baum!$K$58","v":"Scheibe: 14"},null,null,null,null,null,"1./2. od. 3./4. Platz",null,null,null,null,null,"Scheibe:"]
[null,1,2,"Summe","Punkte","Gesamt",null,null,null,null,null,null,null,1,2,"Summe","Punkte","Gesamt"]
[1,null,null,null,null,null,null,null,null,null,null,null,1]
[]
[2,null,null,null,null,null,null,null,null,null,null,null,2]
[]
[3,null,null,null,null,null,null,null,null,null,null,null,3]
[]
["wenn erforderlich",null,null,null,null,null,null,null,null,null,null,null,"wenn erforderlich"]
[4,null,null,null,null,null,null,null,null,null,null,null,4]
[]
["Stechen wenn erforderlich",null,null,null,null,null,null,null,null,null,null,null,"Stechen wenn erforderlich"]
[null,null,null,null,null,null,null,null,"gewonnen",null,null,null,null,null,null,null,null,null,null,null,"gewonnen"]
[null,null,null,null,null,null,null,null,"verloren",null,null,null,null,null,null,null,null,null,null,null,"verloren"]
[]
[null,"Schreiber:",null,null,null,null,null,"Kontrolle:",null,null,null,null,null,"Schreiber:",null,null,null,null,null,"Kontrolle:"]
[]
[]
[]
[{"$f":"Select!$C$12","v":"ÖM Indoor 2019"},null,null,null,null,null,null,null,null,null,null,null,"Mannschaft:",null,null,{"$f":"MR16_Baum!$C$41","v":"RM_10"}]
["Veranstaltung"]
[{"$f":"Select!$C$13","v":"09.-10. Februar 2019"},null,null,null,null,null,null,null,null,null,null,null,"Schützen:",null,null,{"$f":"MR16_Baum!$C$42","v":"Schütze1_RM10 Schütze2_RM10"}]
["Datum"]
["Bewerb:",null,{"$f":"Select!$C$14","v":"Mannschaftsbewerb"},null,null,null,null,null,null,null,null,null,"Bogenklasse:",null,null,{"$f":"Select!$C$18","v":"Instinktivbogen Herren"}]
[]
[]
["1/8 Elimination",null,null,null,null,null,{"$f":"MR16_Baum!$C$68","v":"Scheibe: 44"},null,null,null,null,null,"1/4 Finale",null,null,null,null,null,{"$f":"MR16_Baum!$G$61","v":"Scheibe: 27"}]
[null,1,2,"Summe","Punkte","Gesamt",null,null,null,null,null,null,null,1,2,"Summe","Punkte","Gesamt"]
[1,null,null,null,null,null,null,null,null,null,null,null,1]
[]
[2,null,null,null,null,null,null,null,null,null,null,null,2]
[]
[3,null,null,null,null,null,null,null,null,null,null,null,3]
[]
["wenn erforderlich",null,null,null,null,null,null,null,null,null,null,null,"wenn erforderlich"]
[4,null,null,null,null,null,null,null,null,null,null,null,4]
[]
["Stechen wenn erforderlich",null,null,null,null,null,null,null,null,null,null,null,"Stechen wenn erforderlich"]
[null,null,null,null,null,null,null,null,"gewonnen",null,null,null,null,null,null,null,null,null,null,null,"gewonnen"]
[null,null,null,null,null,null,null,null,"verloren",null,null,null,null,null,null,null,null,null,null,null,"verloren"]
[]
[null,"Schreiber:",null,null,null,null,null,"Kontrolle:",null,null,null,null,null,"Schreiber:",null,null,null,null,null,"Kontrolle:"]
[]
[]
["1/2 Finale",null,null,null,null,null,{"$f":"MR16_Baum!$K$58","v":"Scheibe: 14"},null,null,null,null,null,"1./2. od. 3./4. Platz",null,null,null,null,null,"Scheibe:"]
[null,1,2,"Summe","Punkte","Gesamt",null,null,null,null,null,null,null,1,2,"Summe","Punkte","Gesamt"]
[1,null,null,null,null,null,null,null,null,null,null,null,1]
[]
[2,null,null,null,null,null,null,null,null,null,null,null,2]
[]
[3,null,null,null,null,null,null,null,null,null,null,null,3]
[]
["wenn erforderlich",null,null,null,null,null,null,null,null,null,null,null,"wenn erforderlich"]
[4,null,null,null,null,null,null,null,null,null,null,null,4]
[]
["Stechen wenn erforderlich",null,null,null,null,null,null,null,null,null,null,null,"Stechen wenn erforderlich"]
[null,null,null,null,null,null,null,null,"gewonnen",null,null,null,null,null,null,null,null,null,null,null,"gewonnen"]
[null,null,null,null,null,null,null,null,"verloren",null,null,null,null,null,null,null,null,null,null,null,"verloren"]
[]
[null,"Schreiber:",null,null,null,null,null,"Kontrolle:",null,null,null,null,null,"Schreiber:",null,null,null,null,null,"Kontrolle:"]
[]
[]
[]
[{"$f":"Select!$C$12","v":"ÖM Indoor 2019"},null,null,null,null,null,null,null,null,null,null,null,"Mannschaft:",null,null,{"$f":"MR16_Baum!$C$45","v":"RM_15"}]
["Veranstaltung"]
[{"$f":"Select!$C$13","v":"09.-10. Februar 2019"},null,null,null,null,null,null,null,null,null,null,null,"Schützen:",null,null,{"$f":"MR16_Baum!$C$46","v":"Schütze1_RM15 Schütze2_RM15"}]
["Datum"]
["Bewerb:",null,{"$f":"Select!$C$14","v":"Mannschaftsbewerb"},null,null,null,null,null,null,null,null,null,"Bogenklasse:",null,null,{"$f":"Select!$C$18","v":"Instinktivbogen Herren"}]
[]
[]
["1/8 Elimination",null,null,null,null,null,{"$f":"MR16_Baum!$C$69","v":"Scheibe: 45"},null,null,null,null,null,"1/4 Finale",null,null,null,null,null,{"$f":"MR16_Baum!$G$62","v":"Scheibe: 28"}]
[null,1,2,"Summe","Punkte","Gesamt",null,null,null,null,null,null,null,1,2,"Summe","Punkte","Gesamt"]
[1,null,null,null,null,null,null,null,null,null,null,null,1]
[]
[2,null,null,null,null,null,null,null,null,null,null,null,2]
[]
[3,null,null,null,null,null,null,null,null,null,null,null,3]
[]
["wenn erforderlich",null,null,null,null,null,null,null,null,null,null,null,"wenn erforderlich"]
[4,null,null,null,null,null,null,null,null,null,null,null,4]
[]
["Stechen wenn erforderlich",null,null,null,null,null,null,null,null,null,null,null,"Stechen wenn erforderlich"]
[null,null,null,null,null,null,null,null,"gewonnen",null,null,null,null,null,null,null,null,null,null,null,"gewonnen"]
[null,null,null,null,null,null,null,null,"verloren",null,null,null,null,null,null,null,null,null,null,null,"verloren"]
[]
[null,"Schreiber:",null,null,null,null,null,"Kontrolle:",null,null,null,null,null,"Schreiber:",null,null,null,null,null,"Kontrolle:"]
[]
[]
["1/2 Finale",null,null,null,null,null,{"$f":"MR16_Baum!$K$58","v":"Scheibe: 14"},null,null,null,null,null,"1./2. od. 3./4. Platz",null,null,null,null,null,"Scheibe:"]
[null,1,2,"Summe","Punkte","Gesamt",null,null,null,null,null,null,null,1,2,"Summe","Punkte","Gesamt"]
[1,null,null,null,null,null,null,null,null,null,null,null,1]
[]
[2,null,null,null,null,null,null,null,null,null,null,null,2]
[]
[3,null,null,null,null,null,null,null,null,null,null,null,3]
[]
["wenn erforderlich",null,null,null,null,null,null,null,null,null,null,null,"wenn erforderlich"]
[4,null,null,null,null,null,null,null,null,null,null,null,4]
[]
["Stechen wenn erforderlich",null,null,null,null,null,null,null,null,null,null,null,"Stechen wenn erforderlich"]
[null,null,null,null,null,null,null,null,"gewonnen",null,null,null,null,null,null,null,null,null,null,null,"gewonnen"]
[null,null,null,null,null,null,null,null,"verloren",null,null,null,null,null,null,null,null,null,null,null,"verloren"]
[]
[null,"Schreiber:",null,null,null,null,null,"Kontrolle:",null,null,null,null,null,"Schreiber:",null,null,null,null,null,"Kontrolle:"]
[]
[]
[]
[{"$f":"Select!$C$12","v":"ÖM Indoor 2019"},null,null,null,null,null,null,null,null,null,null,null,"Mannschaft:",null,null,{"$f":"MR16_Baum!$C$47","v":"RM_2"}]
["Veranstaltung"]
[{"$f":"Select!$C$13","v":"09.-10. Februar 2019"},null,null,null,null,null,null,null,null,null,null,null,"Schützen:",null,null,{"$f":"MR16_Baum!$C$48","v":"Schütze1_RM2 Schütze2_RM2"}]
["Datum"]
["Bewerb:",null,{"$f":"Select!$C$14","v":"Mannschaftsbewerb"},null,null,null,null,null,null,null,null,null,"Bogenklasse:",null,null,{"$f":"Select!$C$18","v":"Instinktivbogen Herren"}]
[]
[]
["1/8 Elimination",null,null,null,null,null,{"$f":"MR16_Baum!$C$70","v":"Scheibe: 46"},null,null,null,null,null,"1/4 Finale",null,null,null,null,null,{"$f":"MR16_Baum!$G$62","v":"Scheibe: 28"}]
[null,1,2,"Summe","Punkte","Gesamt",null,null,null,null,null,null,null,1,2,"Summe","Punkte","Gesamt"]
[1,null,null,null,null,null,null,null,null,null,null,null,1]
[]
[2,null,null,null,null,null,null,null,null,null,null,null,2]
[]
[3,null,null,null,null,null,null,null,null,null,null,null,3]
[]
["wenn erforderlich",null,null,null,null,null,null,null,null,null,null,null,"wenn erforderlich"]
[4,null,null,null,null,null,null,null,null,null,null,null,4]
[]
["Stechen wenn erforderlich",null,null,null,null,null,null,null,null,null,null,null,"Stechen wenn erforderlich"]
[null,null,null,null,null,null,null,null,"gewonnen",null,null,null,null,null,null,null,null,null,null,null,"gewonnen"]
[null,null,null,null,null,null,null,null,"verloren",null,null,null,null,null,null,null,null,null,null,null,"verloren"]
[]
[null,"Schreiber:",null,null,null,null,null,"Kontrolle:",null,null,null,null,null,"Schreiber:",null,null,null,null,null,"Kontrolle:"]
[]
[]
["1/2 Finale",null,null,null,null,null,{"$f":"MR16_Baum!$K$58","v":"Scheibe: 14"},null,null,null,null,null,"1./2. od. 3./4. Platz",null,null,null,null,null,"Scheibe:"]
[null,1,2,"Summe","Punkte","Gesamt",null,null,null,null,null,null,null,1,2,"Summe","Punkte","Gesamt"]
[1,null,null,null,null,null,null,null,null,null,null,null,1]
[]
[2,null,null,null,null,null,null,null,null,null,null,null,2]
[]
[3,null,null,null,null,null,null,null,null,null,null,null,3]
[]
["wenn erforderlich",null,null,null,null,null,null,null,null,null,null,null,"wenn erforderlich"]
[4,null,null,null,null,null,null,null,null,null,null,null,4]
[]
["Stechen wenn erforderlich",null,null,null,null,null,null,null,null,null,null,null,"Stechen wenn erforderlich"]
[null,null,null,null,null,null,null,null,"gewonnen",null,null,null,null,null,null,null,null,null,null,null,"gewonnen"]
[null,null,null,null,null,null,null,null,"verloren",null,null,null,null,null,null,null,null,null,null,null,"verloren"]
[]
[null,"Schreiber:",null,null,null,null,null,"Kontrolle:",null,null,null,null,null,"Schreiber:",null,null,null,null,null,"Kontrolle:"]

{"sheet":"MR16F","index":7,"n_rows":33,"n_cols":16,"rows_kept":33,"cut":false,"hidden":true,"merged":[[0,5,0,10],[8,0,8,2],[8,9,8,10],[11,0,11,1],[9,0,9,6],[9,9,9,15],[2,6,2,9],[8,3,8,6],[8,11,8,15],[11,14,11,15],[23,0,23,1],[23,14,23,15],[17,0,17,1],[16,0,16,1],[15,0,15,1],[18,0,18,1],[19,0,19,1],[19,14,19,15],[12,0,12,1],[12,14,12,15],[24,0,24,1],[24,14,24,15],[28,14,28,15],[26,0,26,1],[26,14,26,15],[14,0,14,1],[13,0,13,1],[20,0,20,1],[22,0,22,1],[13,14,13,15],[15,14,15,15],[16,14,16,15],[18,14,18,15],[22,14,22,15]]}
[null,null,null,null,null,{"$f":"Select!C12","v":"ÖM Indoor 2019"}]
[null,null,null,null,null,null,null,null,null,null,null,null,null,null,null,{"$f":"Select!C13","v":"09.-10. Februar 2019"}]
[{"$f":"Select!C14","v":"Mannschaftsbewerb"},null,null,null,null,null,"Gold-Finale",null,null,null,null,null,null,null,null,{"$f":"Select!C18","v":"Instinktivbogen Herren"}]
[]
[]
[null,null,"Sieger",null,null,null,null,null,null,null,null,null,null,"Sieger"]
[]
[]
["Mannschaft",null,null,{"$f":"MR16_Baum!O21","v":""},null,null,null,null,null,{"$f":"A9","v":"Mannschaft"},null,{"$f":"MR16_Baum!O23","v":""}]
[{"$f":"MR16_Baum!O22","v":""},null,null,null,null,null,null,null,null,{"$f":"MR16_Baum!O24","v":""}]
[]
[null,null,"1","2","Summe","Punkte","Gesamt",null,null,null,{"$f":"C12","v":"1"},{"$f":"D12","v":"2"},{"$f":"E12","v":"Summe"},{"$f":"F12","v":"Punkte"},{"$f":"G12","v":"Gesamt"}]
[]
[1,null,null,null,null,null,null,null,null,1]
[]
[]
[2,null,null,null,null,null,null,null,null,2]
[]
[]
[3,null,null,null,null,null,null,null,null,3]
[]
["wenn erforderlich",null,null,null,null,null,null,null,null,{"$f":"A22","v":"wenn erforderlich"}]
[]
[4,null,null,null,null,null,null,null,null,4]
[]
["Stechen wenn erforderlich",null,null,null,null,null,null,null,null,{"$f":"A26","v":"Stechen wenn erforderlich"}]
[]
[]
[]
[]
["Schütze:",null,null,null,null,null,null,null,null,{"$f":"A31","v":"Schütze:"}]
[]
[null,null,null,null,"Schreiber:"]

{"sheet":"MR16_Ergebnis","index":8,"n_rows":25,"n_cols":17,"rows_kept":25,"cut":false,"hidden":true,"merged":[[6,10,6,17],[1,0,1,3],[1,4,1,8],[2,0,2,3],[4,0,4,8],[6,0,6,3]]}
[]
[{"$f":"Select!$C$12","v":"ÖM Indoor 2019"}]
[{"$f":"Select!C13","v":"09.-10. Februar 2019"}]
[]
["Ergebnisliste"]
[]
[{"$f":"CONCATENATE(Select!C14,\" \",Select!C18)","v":"Mannschaftsbewerb Instinktivbogen Herren"},null,null,null,null,null,null,null,null,null,"!!!!!!!!!!!!!!!!!!!!!!!!!!  SORTIERBEREICH - NICHT ENTFERNEN !!!!!!!!!!!!!!!!!!!!!!!!!!"]
[]
["Pl.",null,"Mannschaft","Schützen","Quali.","1/8","1/4","1/2","Finale",null,"SortMannschaft","SortSchützen","SortQuali","Sort 1/8","Sort1/4","Sort1/2","SortFinale"]
[{"$f":"IF(C10<>\"\",1,\"\")","v":""},null,null,null,null,null,null,null,null,null,{"$f":"IF(MR16_Baum!$P$21>MR16_Baum!$P$23,MR16_Baum!$O$21,IF(MR16_Baum!$P$23>MR16_Baum!$P$21,MR16_Baum!$O$23,IF(RIGHT(MR16_Baum!$P$21,1)=\"*\",MR16_Baum!$O$21,IF(RIGHT(MR16_Baum!$P$23,1)=\"*\",MR16_Baum!$O$23,\"\"))))","v":""},{"$f":"VLOOKUP(K10,MR_Quali!$C$10:$D$29,2,FALSE)","v":{"$error":"#N/A"}},{"$f":"VLOOKUP(K10,MR_Quali!$C$10:$G$29,5,FALSE)","v":{"$error":"#N/A"}},{"$f":"VLOOKUP(K10,MR16_Baum!$C$3:$D$48,2,FALSE)","v":{"$error":"#N/A"}},{"$f":"VLOOKUP(K10,MR16_Baum!$G$6:$H$45,2,FALSE)","v":0},{"$f":"VLOOKUP(K10,MR16_Baum!$K$12:$L$39,2,FALSE)","v":0},{"$f":"VLOOKUP(K10,MR16_Baum!$O$21:$P$30,2,FALSE)","v":0}]
[{"$f":"IF(C11<>\"\",A10+1,\"\")","v":""},null,null,null,null,null,null,null,null,null,{"$f":"IF(MR16_Baum!$P$21<MR16_Baum!$P$23,MR16_Baum!$O$21,IF(MR16_Baum!$P$23<MR16_Baum!$P$21,MR16_Baum!$O$23,IF(RIGHT(MR16_Baum!$P$21,1)=\"*\",MR16_Baum!$O$23,IF(RIGHT(MR16_Baum!$P$23,1)=\"*\",MR16_Baum!$O$21,\"\"))))","v":""},{"$f":"VLOOKUP(K11,MR_Quali!$C$10:$D$29,2,FALSE)","v":{"$error":"#N/A"}},{"$f":"VLOOKUP(K11,MR_Quali!$C$10:$G$29,5,FALSE)","v":{"$error":"#N/A"}},{"$f":"VLOOKUP(K11,MR16_Baum!$C$3:$D$48,2,FALSE)","v":{"$error":"#N/A"}},{"$f":"VLOOKUP(K11,MR16_Baum!$G$6:$H$45,2,FALSE)","v":0},{"$f":"VLOOKUP(K11,MR16_Baum!$K$12:$L$39,2,FALSE)","v":0},{"$f":"VLOOKUP(K11,MR16_Baum!$O$21:$P$30,2,FALSE)","v":0}]
["",null,null,null,null,null,null,null,null,null,{"$f":"IF(MR16_Baum!$P$27>MR16_Baum!$P$29,MR16_Baum!$O$27,IF(MR16_Baum!$P$29>MR16_Baum!$P$27,MR16_Baum!$O$29,IF(RIGHT(MR16_Baum!$P$27,1)=\"*\",MR16_Baum!$O$27,IF(RIGHT(MR16_Baum!$P$29,1)=\"*\",MR16_Baum!$O$29,\"\"))))","v":""},{"$f":"VLOOKUP(K12,MR_Quali!$C$10:$D$29,2,FALSE)","v":{"$error":"#N/A"}},{"$f":"VLOOKUP(K12,MR_Quali!$C$10:$G$29,5,FALSE)","v":{"$error":"#N/A"}},{"$f":"VLOOKUP(K12,MR16_Baum!$C$3:$D$48,2,FALSE)","v":{"$error":"#N/A"}},{"$f":"VLOOKUP(K12,MR16_Baum!$G$6:$H$45,2,FALSE)","v":0},{"$f":"VLOOKUP(K12,MR16_Baum!$K$12:$L$39,2,FALSE)","v":0},{"$f":"VLOOKUP(K12,MR16_Baum!$O$21:$P$30,2,FALSE)","v":0}]
["",null,null,null,null,null,null,null,null,null,{"$f":"IF(MR16_Baum!$P$27<MR16_Baum!$P$29,MR16_Baum!$O$27,IF(MR16_Baum!$P$29<MR16_Baum!$P$27,MR16_Baum!$O$29,IF(RIGHT(MR16_Baum!$P$27,1)=\"*\",MR16_Baum!$O$29,IF(RIGHT(MR16_Baum!$P$29,1)=\"*\",MR16_Baum!$O$27,\"\"))))","v":""},{"$f":"VLOOKUP(K13,MR_Quali!$C$10:$D$29,2,FALSE)","v":{"$error":"#N/A"}},{"$f":"VLOOKUP(K13,MR_Quali!$C$10:$G$29,5,FALSE)","v":{"$error":"#N/A"}},{"$f":"VLOOKUP(K13,MR16_Baum!$C$3:$D$48,2,FALSE)","v":{"$error":"#N/A"}},{"$f":"VLOOKUP(K13,MR16_Baum!$G$6:$H$45,2,FALSE)","v":0},{"$f":"VLOOKUP(K13,MR16_Baum!$K$12:$L$39,2,FALSE)","v":0},{"$f":"VLOOKUP(K13,MR16_Baum!$O$21:$P$30,2,FALSE)","v":0}]
["",null,null,null,null,null,null,null,null,null,{"$f":"IF(MR16_Baum!$H$6<MR16_Baum!$H$8,MR16_Baum!$G$6,IF(MR16_Baum!$H$8<MR16_Baum!$H$6,MR16_Baum!$G$8,IF(RIGHT(MR16_Baum!$H$6,1)=\"*\",MR16_Baum!$G$8,IF(RIGHT(MR16_Baum!$H$8,1)=\"*\",MR16_Baum!$G$6,\"\"))))","v":""},{"$f":"VLOOKUP(K14,MR_Quali!$C$10:$D$29,2,FALSE)","v":{"$error":"#N/A"}},{"$f":"VLOOKUP(K14,MR_Quali!$C$10:$G$29,5,FALSE)","v":{"$error":"#N/A"}},{"$f":"VLOOKUP(K14,MR16_Baum!$C$3:$D$48,2,FALSE)","v":{"$error":"#N/A"}},{"$f":"VLOOKUP(K14,MR16_Baum!$G$6:$H$45,2,FALSE)","v":0}]
["",null,null,null,null,null,null,null,null,null,{"$f":"IF(MR16_Baum!$H$18<MR16_Baum!$H$20,MR16_Baum!$G$18,IF(MR16_Baum!$H$20<MR16_Baum!$H$18,MR16_Baum!$G$20,IF(RIGHT(MR16_Baum!$H$18,1)=\"*\",MR16_Baum!$G$20,IF(RIGHT(MR16_Baum!$H$20,1)=\"*\",MR16_Baum!$G$18,\"\"))))","v":""},{"$f":"VLOOKUP(K15,MR_Quali!$C$10:$D$29,2,FALSE)","v":{"$error":"#N/A"}},{"$f":"VLOOKUP(K15,MR_Quali!$C$10:$G$29,5,FALSE)","v":{"$error":"#N/A"}},{"$f":"VLOOKUP(K15,MR16_Baum!$C$3:$D$48,2,FALSE)","v":{"$error":"#N/A"}},{"$f":"VLOOKUP(K15,MR16_Baum!$G$6:$H$45,2,FALSE)","v":0}]
["",null,null,null,null,null,null,null,null,null,{"$f":"IF(MR16_Baum!$H$30<MR16_Baum!$H$32,MR16_Baum!$G$30,IF(MR16_Baum!$H$32<MR16_Baum!$H$30,MR16_Baum!$G$32,IF(RIGHT(MR16_Baum!$H$30,1)=\"*\",MR16_Baum!$G$32,IF(RIGHT(MR16_Baum!$H$32,1)=\"*\",MR16_Baum!$G$30,\"\"))))","v":""},{"$f":"VLOOKUP(K16,MR_Quali!$C$10:$D$29,2,FALSE)","v":{"$error":"#N/A"}},{"$f":"VLOOKUP(K16,MR_Quali!$C$10:$G$29,5,FALSE)","v":{"$error":"#N/A"}},{"$f":"VLOOKUP(K16,MR16_Baum!$C$3:$D$48,2,FALSE)","v":{"$error":"#N/A"}},{"$f":"VLOOKUP(K16,MR16_Baum!$G$6:$H$45,2,FALSE)","v":0}]
["",null,null,null,null,null,null,null,null,null,{"$f":"IF(MR16_Baum!$H$42<MR16_Baum!$H$44,MR16_Baum!$G$42,IF(MR16_Baum!$H$44<MR16_Baum!$H$42,MR16_Baum!$G$44,IF(RIGHT(MR16_Baum!$H$42,1)=\"*\",MR16_Baum!$G$44,IF(RIGHT(MR16_Baum!$H$44,1)=\"*\",MR16_Baum!$G$42,\"\"))))","v":""},{"$f":"VLOOKUP(K17,MR_Quali!$C$10:$D$29,2,FALSE)","v":{"$error":"#N/A"}},{"$f":"VLOOKUP(K17,MR_Quali!$C$10:$G$29,5,FALSE)","v":{"$error":"#N/A"}},{"$f":"VLOOKUP(K17,MR16_Baum!$C$3:$D$48,2,FALSE)","v":{"$error":"#N/A"}},{"$f":"VLOOKUP(K17,MR16_Baum!$G$6:$H$45,2,FALSE)","v":0}]
["",null,null,null,null,null,null,null,null,null,{"$f":"IF(MR16_Baum!G6=MR16_Baum!C3,MR16_Baum!C5,MR16_Baum!C3)","v":"RM_1"},{"$f":"VLOOKUP(K18,MR_Quali!$C$10:$D$29,2,FALSE)","v":"Schütze1_RM1 Schütze2_RM1"},{"$f":"VLOOKUP(K18,MR_Quali!$C$10:$G$29,5,FALSE)","v":632},{"$f":"VLOOKUP(K18,MR16_Baum!$C$3:$D$48,2,FALSE)","v":0}]
["",null,null,null,null,null,null,null,null,null,{"$f":"IF(MR16_Baum!G8=MR16_Baum!C9,MR16_Baum!C11,MR16_Baum!C9)","v":"RM_9"},{"$f":"VLOOKUP(K19,MR_Quali!$C$10:$D$29,2,FALSE)","v":"Schütze1_RM9 Schütze2_RM9"},{"$f":"VLOOKUP(K19,MR_Quali!$C$10:$G$29,5,FALSE)","v":624},{"$f":"VLOOKUP(K19,MR16_Baum!$C$3:$D$48,2,FALSE)","v":0}]
["",null,null,null,null,null,null,null,null,null,{"$f":"IF(MR16_Baum!G18=MR16_Baum!C15,MR16_Baum!C17,MR16_Baum!C15)","v":"RM_5"},{"$f":"VLOOKUP(K20,MR_Quali!$C$10:$D$29,2,FALSE)","v":"Schütze1_RM5 Schütze2_RM5"},{"$f":"VLOOKUP(K20,MR_Quali!$C$10:$G$29,5,FALSE)","v":628},{"$f":"VLOOKUP(K20,MR16_Baum!$C$3:$D$48,2,FALSE)","v":0}]
["",null,null,null,null,null,null,null,null,null,{"$f":"IF(MR16_Baum!G20=MR16_Baum!C21,MR16_Baum!C23,MR16_Baum!C21)","v":"RM_13"},{"$f":"VLOOKUP(K21,MR_Quali!$C$10:$D$29,2,FALSE)","v":"Schütze1_RM13  Schütze2_RM13 "},{"$f":"VLOOKUP(K21,MR_Quali!$C$10:$G$29,5,FALSE)","v":620},{"$f":"VLOOKUP(K21,MR16_Baum!$C$3:$D$48,2,FALSE)","v":0}]
["",null,null,null,null,null,null,null,null,null,{"$f":"IF(MR16_Baum!G30=MR16_Baum!C27,MR16_Baum!C29,MR16_Baum!C27)","v":"RM_3"},{"$f":"VLOOKUP(K22,MR_Quali!$C$10:$D$29,2,FALSE)","v":"Schütze1_RM3 Schütze2_RM3"},{"$f":"VLOOKUP(K22,MR_Quali!$C$10:$G$29,5,FALSE)","v":630},{"$f":"VLOOKUP(K22,MR16_Baum!$C$3:$D$48,2,FALSE)","v":0}]
["",null,null,null,null,null,null,null,null,null,{"$f":"IF(MR16_Baum!G32=MR16_Baum!C33,MR16_Baum!C35,MR16_Baum!C33)","v":"RM_11"},{"$f":"VLOOKUP(K23,MR_Quali!$C$10:$D$29,2,FALSE)","v":"Schütze1_RM11 Schütze2_RM11"},{"$f":"VLOOKUP(K23,MR_Quali!$C$10:$G$29,5,FALSE)","v":622},{"$f":"VLOOKUP(K23,MR16_Baum!$C$3:$D$48,2,FALSE)","v":0}]
["",null,null,null,null,null,null,null,null,null,{"$f":"IF(MR16_Baum!G42=MR16_Baum!C39,MR16_Baum!C41,MR16_Baum!C39)","v":"RM_7"},{"$f":"VLOOKUP(K24,MR_Quali!$C$10:$D$29,2,FALSE)","v":"Schütze1_RM7 Schütze2_RM7"},{"$f":"VLOOKUP(K24,MR_Quali!$C$10:$G$29,5,FALSE)","v":626},{"$f":"VLOOKUP(K24,MR16_Baum!$C$3:$D$48,2,FALSE)","v":0}]
["",null,null,null,null,null,null,null,null,null,{"$f":"IF(MR16_Baum!G44=MR16_Baum!C45,MR16_Baum!C47,MR16_Baum!C45)","v":"RM_15"},{"$f":"VLOOKUP(K25,MR_Quali!$C$10:$D$29,2,FALSE)","v":"Schütze1_RM15 Schütze2_RM15"},{"$f":"VLOOKUP(K25,MR_Quali!$C$10:$G$29,5,FALSE)","v":618},{"$f":"VLOOKUP(K25,MR16_Baum!$C$3:$D$48,2,FALSE)","v":0}]

{"sheet":"MR8_Baum","index":9,"n_rows":62,"n_cols":12,"rows_kept":62,"cut":false,"hidden":true,"merged":[[5,1,6,1],[7,1,8,1],[13,5,14,5],[10,9,11,9],[11,10,11,11],[11,5,12,5],[35,5,36,5],[17,1,18,1],[19,1,20,1],[10,10,10,11],[38,10,39,11],[29,1,30,1],[31,1,32,1],[20,9,21,9],[22,9,23,9],[26,9,27,9],[28,9,29,9],[1,6,2,11],[3,6,4,11],[41,6,42,7],[6,10,6,11],[7,10,7,11],[6,9,7,9],[8,9,9,9],[8,10,8,11],[9,10,9,11],[45,7,46,11],[41,1,42,1],[37,5,38,5],[47,2,48,3],[43,1,44,1]]}
[]
[null,null,null,null,null,null,{"$f":"Select!C12","v":"ÖM Indoor 2019"}]
[]
[null,null,null,null,null,null,{"$f":"Select!C13","v":"09.-10. Februar 2019"}]
[null,"Schb","Name","Erg."]
[null,{"$f":"D55","v":31},{"$f":"MR_Quali!C10","v":"RM_1"}]
[1,null,{"$f":"MR_Quali!D10","v":"Schütze1_RM1 Schütze2_RM1"},{"$f":"MR_Quali!G10","v":632},"Quali.",null,null,null,null,"1.",{"$f":"IF($L$21>$L$23,$K$21,IF($L$23>$L$21,$K$23,IF(RIGHT($L$21,1)=\"*\",$K$21,IF(RIGHT($L$23,1)=\"*\",$K$23,\"\"))))","v":""}]
[8,{"$f":"D56","v":32},{"$f":"MR_Quali!C17","v":"RM_8"},null,null,null,null,null,null,null,{"$f":"IF($L$21>$L$23,$K$22,IF($L$23>$L$21,$K$24,IF(RIGHT($L$21,1)=\"*\",$K$22,IF(RIGHT($L$23,1)=\"*\",$K$24,\"\"))))","v":""}]
[null,null,{"$f":"MR_Quali!D17","v":"Schütze1_RM8 Schütze2_RM8"},{"$f":"MR_Quali!G17","v":625},"Quali.",null,null,null,null,"2.",{"$f":"IF($L$21<$L$23,$K$21,IF($L$23<$L$21,$K$23,IF(RIGHT($L$21,1)=\"\",$K$21,IF(RIGHT($L$23,1)=\"\",$K$23,\"\"))))","v":""}]
[null,null,null,null,null,null,null,null,null,null,{"$f":"IF($L$21<$L$23,$K$22,IF($L$23<$L$21,$K$24,IF(RIGHT($L$21,1)=\"\",$K$22,IF(RIGHT($L$23,1)=\"\",$K$24,\"\"))))","v":""}]
[null,null,null,null,null,"Schb","Name","Erg.",null,"3.",{"$f":"IF($L$27>$L$29,$K$27,IF($L$29>$L$27,$K$29,IF(RIGHT($L$27,1)=\"*\",$K$27,IF(RIGHT($L$29,1)=\"*\",$K$29,\"\"))))","v":""}]
[null,null,null,null,null,{"$f":"H55","v":21},{"$f":"IF($D6>$D8,$C6,IF($D8>$D6,$C8,IF(RIGHT($D6,1)=\"*\",$C6,IF(RIGHT($D8,1)=\"*\",$C8,\"\"))))","v":""},null,null,null,{"$f":"IF($L$27>$L$29,$K$28,IF($L$29>$L$27,$K$30,IF(RIGHT($L$27,1)=\"*\",$K$28,IF(RIGHT($L$29,1)=\"*\",$K$30,\"\"))))","v":""}]
[null,null,null,null,null,null,{"$f":"IF($D6>$D8,$C7,IF($D8>$D6,$C9,IF(RIGHT($D6,1)=\"*\",$C7,IF(RIGHT($D8,1)=\"*\",$C9,\"\"))))","v":""}]
[null,null,null,null,null,{"$f":"H56","v":22},{"$f":"IF($D18>$D20,$C18,IF($D20>$D18,$C20,IF(RIGHT($D18,1)=\"*\",$C18,IF(RIGHT($D20,1)=\"*\",$C20,\"\"))))","v":""}]
[null,null,null,null,null,null,{"$f":"IF($D18>$D20,$C19,IF($D20>$D18,$C21,IF(RIGHT($D18,1)=\"*\",$C19,IF(RIGHT($D20,1)=\"*\",$C21,\"\"))))","v":""}]
[]
[]
[null,{"$f":"D57","v":33},{"$f":"MR_Quali!C14","v":"RM_5"},null,null,null,null,null,null,null,""]
[5,null,{"$f":"MR_Quali!D14","v":"Schütze1_RM5 Schütze2_RM5"},{"$f":"MR_Quali!G14","v":628},"Quali.",null,null,null,null,null,""]
[4,{"$f":"D58","v":34},{"$f":"MR_Quali!C13","v":"RM_4"},null,null,null,null,null,null,"Schb","Name","Erg."]
[null,null,{"$f":"MR_Quali!D13","v":"Schütze1_RM4 Schütze2_RM4"},{"$f":"MR_Quali!G13","v":629},"Quali.",null,null,null,null,{"$f":"L55","v":1},{"$f":"IF($H12>$H14,$G12,IF($H14>$H12,$G14,IF(RIGHT($H12,1)=\"*\",$G12,IF(RIGHT($H14,1)=\"*\",$G14,\"\"))))","v":""}]
[null,null,null,null,null,null,null,"Finale",null,null,{"$f":"IF($H12>$H14,$G13,IF($H14>$H12,$G15,IF(RIGHT($H12,1)=\"*\",$G13,IF(RIGHT($H14,1)=\"*\",$G15,\"\"))))","v":""}]
[null,null,null,null,null,null,null,"1. und 2. Platz",null,{"$f":"L56","v":2},{"$f":"IF($H36>$H38,$G36,IF($H38>$H36,$G38,IF(RIGHT($H36,1)=\"*\",$G36,IF(RIGHT($H38,1)=\"*\",$G38,\"\"))))","v":""}]
[null,null,null,null,null,null,null,null,null,null,{"$f":"IF($H36>$H38,$G37,IF($H38>$H36,$G39,IF(RIGHT($H36,1)=\"*\",$G37,IF(RIGHT($H38,1)=\"*\",$G39,\"\"))))","v":""}]
[]
[]
[null,null,null,null,null,null,null,null,null,{"$f":"L57","v":11},{"$f":"IF($H12<$H14,$G12,IF($H14<$H12,$G14,IF(RIGHT($H12,1)=\"*\",$G14,IF(RIGHT($H14,1)=\"*\",$G12,\"\"))))","v":""}]
[null,null,null,null,null,null,null,"Finale",null,null,{"$f":"IF($H12<$H14,$G13,IF($H14<$H12,$G15,IF(RIGHT($H12,1)=\"*\",$G12,IF(RIGHT($H14,1)=\"*\",$G14,\"\"))))","v":""}]
[null,null,null,null,null,null,null,"3. und 4. Platz",null,{"$f":"L58","v":12},{"$f":"IF($H36<$H38,$G36,IF($H38<$H36,$G38,IF(RIGHT($H36,1)=\"*\",$G38,IF(RIGHT($H38,1)=\"*\",$G36,\"\"))))","v":""}]
[null,{"$f":"D59","v":35},{"$f":"MR_Quali!C12","v":"RM_3"},null,null,null,null,null,null,null,{"$f":"IF($H36<$H38,$G37,IF($H38<$H36,$G39,IF(RIGHT($H36,1)=\"*\",$G39,IF(RIGHT($H38,1)=\"*\",$G37,\"\"))))","v":""}]
[3,null,{"$f":"MR_Quali!D12","v":"Schütze1_RM3 Schütze2_RM3"},{"$f":"MR_Quali!G12","v":630},"Quali."]
[6,{"$f":"D60","v":36},{"$f":"MR_Quali!C15","v":"RM_6"}]
[null,null,{"$f":"MR_Quali!D15","v":"Schütze1_RM6 Schütze2_RM6"},{"$f":"MR_Quali!G15","v":627},"Quali."]
[]
[]
[null,null,null,null,null,{"$f":"H57","v":23},{"$f":"IF($D30>$D32,$C30,IF($D32>$D30,$C32,IF(RIGHT($D30,1)=\"*\",$C30,IF(RIGHT($D32,1)=\"*\",$C32,\"\"))))","v":""}]
[null,null,null,null,null,null,{"$f":"IF($D30>$D32,$C31,IF($D32>$D30,$C33,IF(RIGHT($D30,1)=\"*\",$C31,IF(RIGHT($D32,1)=\"*\",$C33,\"\"))))","v":""}]
[null,null,null,null,null,{"$f":"H58","v":24},{"$f":"IF($D42>$D44,$C42,IF($D44>$D42,$C44,IF(RIGHT($D42,1)=\"*\",$C42,IF(RIGHT($D44,1)=\"*\",$C44,\"\"))))","v":""}]
[null,null,null,null,null,null,{"$f":"IF($D42>$D44,$C43,IF($D44>$D42,$C45,IF(RIGHT($D42,1)=\"*\",$C43,IF(RIGHT($D44,1)=\"*\",$C45,\"\"))))","v":""},null,null,null,"Finale"]
[]
[]
[null,{"$f":"D61","v":37},{"$f":"MR_Quali!C16","v":"RM_7"},null,null,null,"1/2 Finale"]
[7,null,{"$f":"MR_Quali!D16","v":"Schütze1_RM7 Schütze2_RM7"},{"$f":"MR_Quali!G16","v":626},"Quali."]
[2,{"$f":"D62","v":38},{"$f":"MR_Quali!C11","v":"RM_2"}]
[null,null,{"$f":"MR_Quali!D11","v":"Schütze1_RM2 Schütze2_RM2"},{"$f":"MR_Quali!G11","v":631},"Quali."]
[null,null,null,null,null,null,null,{"$f":"CONCATENATE(Select!C14,\" \",Select!C18)","v":"Mannschaftsbewerb Instinktivbogen Herren"}]
[]
[null,null,"1/4 Finale"]
[null,null,null,null,null,null,null,null,null,"*","= Im Stechen gewonnen"]
[]
[]
[]
[]
[null,null,"Scheibe:"]
[null,1,{"$f":"CONCATENATE($C$54,\" \",D55)","v":"Scheibe: 31"},31,null,1,{"$f":"CONCATENATE($C$54,\" \",H55)","v":"Scheibe: 21"},21,null,1,{"$f":"CONCATENATE($C$54,\" \",L55)","v":"Scheibe: 1"},1]
[null,null,"Scheibe: 32",{"$f":"IF(RIGHT(D55,1)=\"A\",CONCATENATE(LEFT(D55,LEN(D55)-1),\"B\"),D55+1)","v":32},null,null,{"$f":"CONCATENATE($C$54,\" \",H56)","v":"Scheibe: 22"},{"$f":"IF(RIGHT(H55,1)=\"A\",CONCATENATE(LEFT(H55,LEN(H55)-1),\"B\"),H55+1)","v":22},null,null,{"$f":"CONCATENATE($C$54,\" \",L56)","v":"Scheibe: 2"},{"$f":"IF(RIGHT(L55,1)=\"A\",CONCATENATE(LEFT(L55,LEN(L55)-1),\"B\"),L55+1)","v":2}]
[null,{"$f":"B55+1","v":2},"Scheibe: 33",{"$f":"IF(RIGHT(D56,1)=\"B\",CONCATENATE(LEFT(D56,LEN(D56)-1)+1,\"A\"),D56+1)","v":33},null,{"$f":"F55+1","v":2},{"$f":"CONCATENATE($C$54,\" \",H57)","v":"Scheibe: 23"},{"$f":"IF(RIGHT(H56,1)=\"B\",CONCATENATE(LEFT(H56,LEN(H56)-1)+1,\"A\"),H56+1)","v":23},null,{"$f":"J55+1","v":2},{"$f":"CONCATENATE($C$54,\" \",L57)","v":"Scheibe: 11"},11]
[null,null,"Scheibe: 34",{"$f":"IF(RIGHT(D57,1)=\"A\",CONCATENATE(LEFT(D57,LEN(D57)-1),\"B\"),D57+1)","v":34},null,null,{"$f":"CONCATENATE($C$54,\" \",H58)","v":"Scheibe: 24"},{"$f":"IF(RIGHT(H57,1)=\"A\",CONCATENATE(LEFT(H57,LEN(H57)-1),\"B\"),H57+1)","v":24},null,null,{"$f":"CONCATENATE($C$54,\" \",L58)","v":"Scheibe: 12"},{"$f":"IF(RIGHT(L57,1)=\"A\",CONCATENATE(LEFT(L57,LEN(L57)-1),\"B\"),L57+1)","v":12}]
[null,{"$f":"B57+1","v":3},"Scheibe: 35",{"$f":"IF(RIGHT(D58,1)=\"B\",CONCATENATE(LEFT(D58,LEN(D58)-1)+1,\"A\"),D58+1)","v":35}]
[null,null,"Scheibe: 36",{"$f":"IF(RIGHT(D59,1)=\"A\",CONCATENATE(LEFT(D59,LEN(D59)-1),\"B\"),D59+1)","v":36}]
[null,{"$f":"B59+1","v":4},"Scheibe: 37",{"$f":"IF(RIGHT(D60,1)=\"B\",CONCATENATE(LEFT(D60,LEN(D60)-1)+1,\"A\"),D60+1)","v":37}]
[null,null,"Scheibe: 38",{"$f":"IF(RIGHT(D61,1)=\"A\",CONCATENATE(LEFT(D61,LEN(D61)-1),\"B\"),D61+1)","v":38}]

{"sheet":"MR8","index":10,"n_rows":350,"n_cols":23,"rows_kept":350,"cut":false,"hidden":true,"merged":[[34,0,36,0],[38,0,40,0],[34,13,36,13],[38,13,40,13],[46,0,46,10],[45,0,45,10],[45,16,45,23],[8,0,8,5],[8,6,8,11],[10,0,12,0],[13,0,15,0],[8,19,8,24],[8,13,8,18],[26,19,26,24],[10,13,12,13],[13,13,15,13],[28,13,30,13],[31,13,33,13],[1,0,1,10],[3,0,3,10],[4,0,4,10],[2,0,2,10],[26,0,26,5],[26,13,26,18],[26,6,26,11],[28,0,30,0],[31,0,33,0],[1,16,1,23],[5,16,5,23],[3,16,4,23],[16,13,18,13],[20,13,22,13],[5,2,5,10],[47,0,47,10],[47,16,48,23],[48,0,48,10],[135,0,135,10],[135,16,136,23],[136,0,136,10],[137,16,137,23],[140,0,140,5],[140,6,140,11],[140,13,140,18],[140,19,140,24],[72,13,74,13],[75,0,77,0],[75,13,77,13],[89,0,89,10],[89,16,89,23],[90,0,90,10],[91,16,92,23],[49,16,49,23],[52,0,52,5],[52,6,52,11],[52,13,52,18],[52,19,52,24],[70,13,70,18],[346,0,348,0],[346,13,348,13],[228,0,228,5],[228,6,228,11],[228,13,228,18],[204,0,206,0],[204,13,206,13],[202,0,202,5],[202,6,202,11],[202,13,202,18],[221,0,221,10],[221,16,221,23],[222,0,222,10],[223,0,223,10],[223,16,224,23],[224,0,224,10],[334,19,334,24],[334,0,334,5],[334,6,334,11],[334,13,334,18],[336,0,338,0],[336,13,338,13],[339,0,341,0],[339,13,341,13],[342,0,344,0],[342,13,344,13],[290,0,290,5],[290,6,290,11],[290,13,290,18],[292,0,294,0],[292,13,294,13],[309,0,309,10],[309,16,309,23],[310,0,310,10],[311,0,311,10],[311,16,312,23],[312,0,312,10],[290,19,290,24],[318,0,320,0],[318,13,320,13],[321,0,323,0],[321,13,323,13],[324,13,326,13],[328,13,330,13],[295,0,297,0],[295,13,297,13],[302,0,304,0],[302,13,304,13],[72,0,74,0],[78,13,80,13],[82,13,84,13],[78,0,80,0],[82,0,84,0],[93,16,93,23],[96,0,96,5],[96,6,96,11],[96,13,96,18],[96,19,96,24],[92,0,92,10],[70,19,70,24],[54,0,56,0],[54,13,56,13],[57,0,59,0],[57,13,59,13],[70,0,70,5],[70,6,70,11],[60,13,62,13],[64,13,66,13],[184,0,184,5],[184,6,184,11],[184,13,184,18],[184,19,184,24],[163,13,165,13],[166,0,168,0],[158,0,158,5],[158,6,158,11],[158,13,158,18],[158,19,158,24],[160,0,162,0],[160,13,162,13],[179,0,179,10],[180,0,180,10],[148,13,150,13],[152,13,154,13],[163,0,165,0],[98,0,100,0],[98,13,100,13],[104,13,106,13],[108,13,110,13],[181,16,181,23],[119,13,121,13],[114,0,114,5],[114,6,114,11],[114,13,114,18],[145,0,147,0],[145,13,147,13],[133,16,133,23],[134,0,134,10],[142,0,144,0],[142,13,144,13],[230,0,232,0],[230,13,232,13],[233,0,235,0],[233,13,235,13],[202,19,202,24],[186,0,188,0],[186,13,188,13],[101,0,103,0],[101,13,103,13],[177,0,177,10],[177,16,177,23],[178,0,178,10],[122,0,124,0],[126,0,128,0],[122,13,124,13],[126,13,128,13],[166,13,168,13],[170,0,172,0],[170,13,172,13],[114,19,114,24],[116,0,118,0],[116,13,118,13],[119,0,121,0],[179,16,180,23],[313,16,313,23],[316,0,316,5],[316,6,316,11],[316,13,316,18],[316,19,316,24],[277,0,279,0],[277,13,279,13],[280,13,282,13],[284,13,286,13],[298,0,300,0],[298,13,300,13],[225,16,225,23],[228,19,228,24],[214,0,216,0],[274,0,276,0],[274,13,276,13],[272,19,272,24],[269,16,269,23],[272,0,272,5],[272,6,272,11],[272,13,272,18],[258,13,260,13],[265,0,265,10],[265,16,265,23],[266,0,266,10],[267,0,267,10],[267,16,268,23],[268,0,268,10],[254,13,256,13],[258,0,260,0],[246,0,246,5],[246,6,246,11],[246,13,246,18],[246,19,246,24],[251,0,253,0],[49,2,49,10],[93,2,93,10],[137,2,137,10],[181,2,181,10],[225,2,225,10],[269,2,269,10],[313,2,313,10],[236,13,238,13],[240,13,242,13],[133,0,133,10],[91,0,91,10],[248,0,250,0],[248,13,250,13],[189,0,191,0],[189,13,191,13],[192,13,194,13],[196,13,198,13],[207,0,209,0],[207,13,209,13],[210,0,212,0],[210,13,212,13],[251,13,253,13],[254,0,256,0],[214,13,216,13]]}
[]
[{"$f":"Select!$C$12","v":"ÖM Indoor 2019"},null,null,null,null,null,null,null,null,null,null,null,null,"Mannschaft:",null,null,{"$f":"MR8_Baum!$C$6","v":"RM_1"}]
["Veranstaltung"]
[{"$f":"Select!$C$13","v":"09.-10. Februar 2019"},null,null,null,null,null,null,null,null,null,null,null,null,"Schützen:",null,null,{"$f":"MR8_Baum!$C$7","v":"Schütze1_RM1 Schütze2_RM1"}]
["Datum"]
["Bewerb:",null,{"$f":"Select!$C$14","v":"Mannschaftsbewerb"},null,null,null,null,null,null,null,null,null,null,"Bogenklasse:",null,null,{"$f":"Select!$C$18","v":"Instinktivbogen Herren"}]
[]
[]
[null,null,null,null,null,null,null,null,null,null,null,null,null,"1/4 Finale",null,null,null,null,null,{"$f":"MR8_Baum!$C$55","v":"Scheibe: 31"}]
[null,null,null,null,null,null,null,null,null,null,null,null,null,null,1,2,"Summe","Punkte","Gesamt"]
[null,null,null,null,null,null,null,null,null,null,null,null,null,1,null,null,null,null,null,null,null,null,"Stechen"]
[null,null,null,null,null,null,null,null,null,null,null,null,null,null,null,null,null,null,null,null,null,1]
[null,null,null,null,null,null,null,null,null,null,null,null,null,null,null,null,null,null,null,null,null,2]
[null,null,null,null,null,null,null,null,null,null,null,null,null,2,null,null,null,null,null,null,null,3]
[]
[]
[null,null,null,null,null,null,null,null,null,null,null,null,null,3,null,null,null,null,null,null,null,"Punkte"]
[]
[null,null,null,null,null,null,null,null,null,null,null,null,null,null,null,null,null,null,null,null,null,"Gesamt"]
[null,null,null,null,null,null,null,null,null,null,null,null,null,"wenn erforderlich"]
[null,null,null,null,null,null,null,null,null,null,null,null,null,4]
[null,null,null,null,null,null,null,null,null,null,null,null,null,null,null,null,null,null,null,null,null,null,"gewonnen"]
[null,null,null,null,null,null,null,null,null,null,null,null,null,null,null,null,null,null,null,null,null,null,"verloren"]
[null,null,null,null,null,null,null,null,null,null,null,null,null,null,"Schreiber:",null,null,null,null,null,"Kontrolle:"]
[]
[]
["1/2 Finale",null,null,null,null,null,{"$f":"MR8_Baum!$G$55","v":"Scheibe: 21"},null,null,null,null,null,null,"1./2. od. 3./4. Platz",null,null,null,null,null,"Scheibe:"]
[null,1,2,"Summe","Punkte","Gesamt",null,null,null,null,null,null,null,null,1,2,"Summe","Punkte","Gesamt"]
[1,null,null,null,null,null,null,null,null,"Stechen",null,null,null,1,null,null,null,null,null,null,null,null,"Stechen"]
[null,null,null,null,null,null,null,null,1,null,null,null,null,null,null,null,null,null,null,null,null,1]
[null,null,null,null,null,null,null,null,2,null,null,null,null,null,null,null,null,null,null,null,null,2]
[2,null,null,null,null,null,null,null,3,null,null,null,null,2,null,null,null,null,null,null,null,3]
[]
[]
[3,null,null,null,null,null,null,null,"Punkte",null,null,null,null,3,null,null,null,null,null,null,null,"Punkte"]
[]
[null,null,null,null,null,null,null,null,"Gesamt",null,null,null,null,null,null,null,null,null,null,null,null,"Gesamt"]
["wenn erforderlich",null,null,null,null,null,null,null,null,null,null,null,null,"wenn erforderlich"]
[4,null,null,null,null,null,null,null,null,null,null,null,null,4]
[null,null,null,null,null,null,null,null,null,"gewonnen",null,null,null,null,null,null,null,null,null,null,null,null,"gewonnen"]
[null,null,null,null,null,null,null,null,null,"verloren",null,null,null,null,null,null,null,null,null,null,null,null,"verloren"]
[null,"Schreiber:",null,null,null,null,null,"Kontrolle:",null,null,null,null,null,null,"Schreiber:",null,null,null,null,null,"Kontrolle:"]
[]
[]
[]
[{"$f":"Select!$C$12","v":"ÖM Indoor 2019"},null,null,null,null,null,null,null,null,null,null,null,null,"Mannschaft:",null,null,{"$f":"MR8_Baum!$C$8","v":"RM_8"}]
["Veranstaltung"]
[{"$f":"Select!$C$13","v":"09.-10. Februar 2019"},null,null,null,null,null,null,null,null,null,null,null,null,"Schützen:",null,null,{"$f":"MR8_Baum!$C$9","v":"Schütze1_RM8 Schütze2_RM8"}]
["Datum"]
["Bewerb:",null,{"$f":"Select!$C$14","v":"Mannschaftsbewerb"},null,null,null,null,null,null,null,null,null,null,"Bogenklasse:",null,null,{"$f":"Select!$C$18","v":"Instinktivbogen Herren"}]
[]
[]
[null,null,null,null,null,null,null,null,null,null,null,null,null,"1/4 Finale",null,null,null,null,null,{"$f":"MR8_Baum!$C$56","v":"Scheibe: 32"}]
[null,null,null,null,null,null,null,null,null,null,null,null,null,null,1,2,"Summe","Punkte","Gesamt"]
[null,null,null,null,null,null,null,null,null,null,null,null,null,1,null,null,null,null,null,null,null,null,"Stechen"]
[null,null,null,null,null,null,null,null,null,null,null,null,null,null,null,null,null,null,null,null,null,1]
[null,null,null,null,null,null,null,null,null,null,null,null,null,null,null,null,null,null,null,null,null,2]
[null,null,null,null,null,null,null,null,null,null,null,null,null,2,null,null,null,null,null,null,null,3]
[]
[]
[null,null,null,null,null,null,null,null,null,null,null,null,null,3,null,null,null,null,null,null,null,"Punkte"]
[]
[null,null,null,null,null,null,null,null,null,null,null,null,null,null,null,null,null,null,null,null,null,"Gesamt"]
[null,null,null,null,null,null,null,null,null,null,null,null,null,"wenn erforderlich"]
[null,null,null,null,null,null,null,null,null,null,null,null,null,4]
[null,null,null,null,null,null,null,null,null,null,null,null,null,null,null,null,null,null,null,null,null,null,"gewonnen"]
[null,null,null,null,null,null,null,null,null,null,null,null,null,null,null,null,null,null,null,null,null,null,"verloren"]
[null,null,null,null,null,null,null,null,null,null,null,null,null,null,"Schreiber:",null,null,null,null,null,"Kontrolle:"]
[]
[]
["1/2 Finale",null,null,null,null,null,{"$f":"MR8_Baum!$G$55","v":"Scheibe: 21"},null,null,null,null,null,null,"1./2. od. 3./4. Platz",null,null,null,null,null,"Scheibe:"]
[null,1,2,"Summe","Punkte","Gesamt",null,null,null,null,null,null,null,null,1,2,"Summe","Punkte","Gesamt"]
[1,null,null,null,null,null,null,null,null,"Stechen",null,null,null,1,null,null,null,null,null,null,null,null,"Stechen"]
[null,null,null,null,null,null,null,null,1,null,null,null,null,null,null,null,null,null,null,null,null,1]
[null,null,null,null,null,null,null,null,2,null,null,null,null,null,null,null,null,null,null,null,null,2]
[2,null,null,null,null,null,null,null,3,null,null,null,null,2,null,null,null,null,null,null,null,3]
[]
[]
[3,null,null,null,null,null,null,null,"Punkte",null,null,null,null,3,null,null,null,null,null,null,null,"Punkte"]
[]
[null,null,null,null,null,null,null,null,"Gesamt",null,null,null,null,null,null,null,null,null,null,null,null,"Gesamt"]
["wenn erforderlich",null,null,null,null,null,null,null,null,null,null,null,null,"wenn erforderlich"]
[4,null,null,null,null,null,null,null,null,null,null,null,null,4]
[null,null,null,null,null,null,null,null,null,"gewonnen",null,null,null,null,null,null,null,null,null,null,null,null,"gewonnen"]
[null,null,null,null,null,null,null,null,null,"verloren",null,null,null,null,null,null,null,null,null,null,null,null,"verloren"]
[null,"Schreiber:",null,null,null,null,null,"Kontrolle:",null,null,null,null,null,null,"Schreiber:",null,null,null,null,null,"Kontrolle:"]
[]
[]
[]
[{"$f":"Select!$C$12","v":"ÖM Indoor 2019"},null,null,null,null,null,null,null,null,null,null,null,null,"Mannschaft:",null,null,{"$f":"MR8_Baum!$C$18","v":"RM_5"}]
["Veranstaltung"]
[{"$f":"Select!$C$13","v":"09.-10. Februar 2019"},null,null,null,null,null,null,null,null,null,null,null,null,"Schützen:",null,null,{"$f":"MR8_Baum!$C$19","v":"Schütze1_RM5 Schütze2_RM5"}]
["Datum"]
["Bewerb:",null,{"$f":"Select!$C$14","v":"Mannschaftsbewerb"},null,null,null,null,null,null,null,null,null,null,"Bogenklasse:",null,null,{"$f":"Select!$C$18","v":"Instinktivbogen Herren"}]
[]
[]
[null,null,null,null,null,null,null,null,null,null,null,null,null,"1/4 Finale",null,null,null,null,null,{"$f":"MR8_Baum!$C$57","v":"Scheibe: 33"}]
[null,null,null,null,null,null,null,null,null,null,null,null,null,null,1,2,"Summe","Punkte","Gesamt"]
[null,null,null,null,null,null,null,null,null,null,null,null,null,1,null,null,null,null,null,null,null,null,"Stechen"]
[null,null,null,null,null,null,null,null,null,null,null,null,null,null,null,null,null,null,null,null,null,1]
[null,null,null,null,null,null,null,null,null,null,null,null,null,null,null,null,null,null,null,null,null,2]
[null,null,null,null,null,null,null,null,null,null,null,null,null,2,null,null,null,null,null,null,null,3]
[]
[]
[null,null,null,null,null,null,null,null,null,null,null,null,null,3,null,null,null,null,null,null,null,"Punkte"]
[]
[null,null,null,null,null,null,null,null,null,null,null,null,null,null,null,null,null,null,null,null,null,"Gesamt"]
[null,null,null,null,null,null,null,null,null,null,null,null,null,"wenn erforderlich"]
[null,null,null,null,null,null,null,null,null,null,null,null,null,4]
[null,null,null,null,null,null,null,null,null,null,null,null,null,null,null,null,null,null,null,null,null,null,"gewonnen"]
[null,null,null,null,null,null,null,null,null,null,null,null,null,null,null,null,null,null,null,null,null,null,"verloren"]
[null,null,null,null,null,null,null,null,null,null,null,null,null,null,"Schreiber:",null,null,null,null,null,"Kontrolle:"]
[]
[]
["1/2 Finale",null,null,null,null,null,{"$f":"MR8_Baum!$G$56","v":"Scheibe: 22"},null,null,null,null,null,null,"1./2. od. 3./4. Platz",null,null,null,null,null,"Scheibe:"]
[null,1,2,"Summe","Punkte","Gesamt",null,null,null,null,null,null,null,null,1,2,"Summe","Punkte","Gesamt"]
[1,null,null,null,null,null,null,null,null,"Stechen",null,null,null,1,null,null,null,null,null,null,null,null,"Stechen"]
[null,null,null,null,null,null,null,null,1,null,null,null,null,null,null,null,null,null,null,null,null,1]
[null,null,null,null,null,null,null,null,2,null,null,null,null,null,null,null,null,null,null,null,null,2]
[2,null,null,null,null,null,null,null,3,null,null,null,null,2,null,null,null,null,null,null,null,3]
[]
[]
[3,null,null,null,null,null,null,null,"Punkte",null,null,null,null,3,null,null,null,null,null,null,null,"Punkte"]
[]
[null,null,null,null,null,null,null,null,"Gesamt",null,null,null,null,null,null,null,null,null,null,null,null,"Gesamt"]
["wenn erforderlich",null,null,null,null,null,null,null,null,null,null,null,null,"wenn erforderlich"]
[4,null,null,null,null,null,null,null,null,null,null,null,null,4]
[null,null,null,null,null,null,null,null,null,"gewonnen",null,null,null,null,null,null,null,null,null,null,null,null,"gewonnen"]
[null,null,null,null,null,null,null,null,null,"verloren",null,null,null,null,null,null,null,null,null,null,null,null,"verloren"]
[null,"Schreiber:",null,null,null,null,null,"Kontrolle:",null,null,null,null,null,null,"Schreiber:",null,null,null,null,null,"Kontrolle:"]
[]
[]
[]
[{"$f":"Select!$C$12","v":"ÖM Indoor 2019"},null,null,null,null,null,null,null,null,null,null,null,null,"Mannschaft:",null,null,{"$f":"MR8_Baum!$C$20","v":"RM_4"}]
["Veranstaltung"]
[{"$f":"Select!$C$13","v":"09.-10. Februar 2019"},null,null,null,null,null,null,null,null,null,null,null,null,"Schützen:",null,null,{"$f":"MR8_Baum!$C$21","v":"Schütze1_RM4 Schütze2_RM4"}]
["Datum"]
["Bewerb:",null,{"$f":"Select!$C$14","v":"Mannschaftsbewerb"},null,null,null,null,null,null,null,null,null,null,"Bogenklasse:",null,null,{"$f":"Select!$C$18","v":"Instinktivbogen Herren"}]
[]
[]
[null,null,null,null,null,null,null,null,null,null,null,null,null,"1/4 Finale",null,null,null,null,null,{"$f":"MR8_Baum!$C$58","v":"Scheibe: 34"}]
[null,null,null,null,null,null,null,null,null,null,null,null,null,null,1,2,"Summe","Punkte","Gesamt"]
[null,null,null,null,null,null,null,null,null,null,null,null,null,1,null,null,null,null,null,null,null,null,"Stechen"]
[null,null,null,null,null,null,null,null,null,null,null,null,null,null,null,null,null,null,null,null,null,1]
[null,null,null,null,null,null,null,null,null,null,null,null,null,null,null,null,null,null,null,null,null,2]
[null,null,null,null,null,null,null,null,null,null,null,null,null,2,null,null,null,null,null,null,null,3]
[]
[]
[null,null,null,null,null,null,null,null,null,null,null,null,null,3,null,null,null,null,null,null,null,"Punkte"]
[]
[null,null,null,null,null,null,null,null,null,null,null,null,null,null,null,null,null,null,null,null,null,"Gesamt"]
[null,null,null,null,null,null,null,null,null,null,null,null,null,"wenn erforderlich"]
[null,null,null,null,null,null,null,null,null,null,null,null,null,4]
[null,null,null,null,null,null,null,null,null,null,null,null,null,null,null,null,null,null,null,null,null,null,"gewonnen"]
[null,null,null,null,null,null,null,null,null,null,null,null,null,null,null,null,null,null,null,null,null,null,"verloren"]
[null,null,null,null,null,null,null,null,null,null,null,null,null,null,"Schreiber:",null,null,null,null,null,"Kontrolle:"]
[]
[]
["1/2 Finale",null,null,null,null,null,{"$f":"MR8_Baum!$G$56","v":"Scheibe: 22"},null,null,null,null,null,null,"1./2. od. 3./4. Platz",null,null,null,null,null,"Scheibe:"]
[null,1,2,"Summe","Punkte","Gesamt",null,null,null,null,null,null,null,null,1,2,"Summe","Punkte","Gesamt"]
[1,null,null,null,null,null,null,null,null,"Stechen",null,null,null,1,null,null,null,null,null,null,null,null,"Stechen"]
[null,null,null,null,null,null,null,null,1,null,null,null,null,null,null,null,null,null,null,null,null,1]
[null,null,null,null,null,null,null,null,2,null,null,null,null,null,null,null,null,null,null,null,null,2]
[2,null,null,null,null,null,null,null,3,null,null,null,null,2,null,null,null,null,null,null,null,3]
[]
[]
[3,null,null,null,null,null,null,null,"Punkte",null,null,null,null,3,null,null,null,null,null,null,null,"Punkte"]
[]
[null,null,null,null,null,null,null,null,"Gesamt",null,null,null,null,null,null,null,null,null,null,null,null,"Gesamt"]
["wenn erforderlich",null,null,null,null,null,null,null,null,null,null,null,null,"wenn erforderlich"]
[4,null,null,null,null,null,null,null,null,null,null,null,null,4]
[null,null,null,null,null,null,null,null,null,"gewonnen",null,null,null,null,null,null,null,null,null,null,null,null,"gewonnen"]
[null,null,null,null,null,null,null,null,null,"verloren",null,null,null,null,null,null,null,null,null,null,null,null,"verloren"]
[null,"Schreiber:",null,null,null,null,null,"Kontrolle:",null,null,null,null,null,null,"Schreiber:",null,null,null,null,null,"Kontrolle:"]
[]
[]
[]
[{"$f":"Select!$C$12","v":"ÖM Indoor 2019"},null,null,null,null,null,null,null,null,null,null,null,null,"Mannschaft:",null,null,{"$f":"MR8_Baum!$C$30","v":"RM_3"}]
["Veranstaltung"]
[{"$f":"Select!$C$13","v":"09.-10. Februar 2019"},null,null,null,null,null,null,null,null,null,null,null,null,"Schützen:",null,null,{"$f":"MR8_Baum!$C$31","v":"Schütze1_RM3 Schütze2_RM3"}]
["Datum"]
["Bewerb:",null,{"$f":"Select!$C$14","v":"Mannschaftsbewerb"},null,null,null,null,null,null,null,null,null,null,"Bogenklasse:",null,null,{"$f":"Select!$C$18","v":"Instinktivbogen Herren"}]
[]
[]
[null,null,null,null,null,null,null,null,null,null,null,null,null,"1/4 Finale",null,null,null,null,null,{"$f":"MR8_Baum!$C$59","v":"Scheibe: 35"}]
[null,null,null,null,null,null,null,null,null,null,null,null,null,null,1,2,"Summe","Punkte","Gesamt"]
[null,null,null,null,null,null,null,null,null,null,null,null,null,1,null,null,null,null,null,null,null,null,"Stechen"]
[null,null,null,null,null,null,null,null,null,null,null,null,null,null,null,null,null,null,null,null,null,1]
[null,null,null,null,null,null,null,null,null,null,null,null,null,null,null,null,null,null,null,null,null,2]
[null,null,null,null,null,null,null,null,null,null,null,null,null,2,null,null,null,null,null,null,null,3]
[]
[]
[null,null,null,null,null,null,null,null,null,null,null,null,null,3,null,null,null,null,null,null,null,"Punkte"]
[]
[null,null,null,null,null,null,null,null,null,null,null,null,null,null,null,null,null,null,null,null,null,"Gesamt"]
[null,null,null,null,null,null,null,null,null,null,null,null,null,"wenn erforderlich"]
[null,null,null,null,null,null,null,null,null,null,null,null,null,4]
[null,null,null,null,null,null,null,null,null,null,null,null,null,null,null,null,null,null,null,null,null,null,"gewonnen"]
[null,null,null,null,null,null,null,null,null,null,null,null,null,null,null,null,null,null,null,null,null,null,"verloren"]
[null,null,null,null,null,null,null,null,null,null,null,null,null,null,"Schreiber:",null,null,null,null,null,"Kontrolle:"]
[]
[]
["1/2 Finale",null,null,null,null,null,{"$f":"MR8_Baum!$G$57","v":"Scheibe: 23"},null,null,null,null,null,null,"1./2. od. 3./4. Platz",null,null,null,null,null,"Scheibe:"]
[null,1,2,"Summe","Punkte","Gesamt",null,null,null,null,null,null,null,null,1,2,"Summe","Punkte","Gesamt"]
[1,null,null,null,null,null,null,null,null,"Stechen",null,null,null,1,null,null,null,null,null,null,null,null,"Stechen"]
[null,null,null,null,null,null,null,null,1,null,null,null,null,null,null,null,null,null,null,null,null,1]
[null,null,null,null,null,null,null,null,2,null,null,null,null,null,null,null,null,null,null,null,null,2]
[2,null,null,null,null,null,null,null,3,null,null,null,null,2,null,null,null,null,null,null,null,3]
[]
[]
[3,null,null,null,null,null,null,null,"Punkte",null,null,null,null,3,null,null,null,null,null,null,null,"Punkte"]
[]
[null,null,null,null,null,null,null,null,"Gesamt",null,null,null,null,null,null,null,null,null,null,null,null,"Gesamt"]
["wenn erforderlich",null,null,null,null,null,null,null,null,null,null,null,null,"wenn erforderlich"]
[4,null,null,null,null,null,null,null,null,null,null,null,null,4]
[null,null,null,null,null,null,null,null,null,"gewonnen",null,null,null,null,null,null,null,null,null,null,null,null,"gewonnen"]
[null,null,null,null,null,null,null,null,null,"verloren",null,null,null,null,null,null,null,null,null,null,null,null,"verloren"]
[null,"Schreiber:",null,null,null,null,null,"Kontrolle:",null,null,null,null,null,null,"Schreiber:",null,null,null,null,null,"Kontrolle:"]
[]
[]
[]
[{"$f":"Select!$C$12","v":"ÖM Indoor 2019"},null,null,null,null,null,null,null,null,null,null,null,null,"Mannschaft:",null,null,{"$f":"MR8_Baum!$C$32","v":"RM_6"}]
["Veranstaltung"]
[{"$f":"Select!$C$13","v":"09.-10. Februar 2019"},null,null,null,null,null,null,null,null,null,null,null,null,"Schützen:",null,null,{"$f":"MR8_Baum!$C$33","v":"Schütze1_RM6 Schütze2_RM6"}]
["Datum"]
["Bewerb:",null,{"$f":"Select!$C$14","v":"Mannschaftsbewerb"},null,null,null,null,null,null,null,null,null,null,"Bogenklasse:",null,null,{"$f":"Select!$C$18","v":"Instinktivbogen Herren"}]
[]
[]
[null,null,null,null,null,null,null,null,null,null,null,null,null,"1/4 Finale",null,null,null,null,null,{"$f":"MR8_Baum!$C$60","v":"Scheibe: 36"}]
[null,null,null,null,null,null,null,null,null,null,null,null,null,null,1,2,"Summe","Punkte","Gesamt"]
[null,null,null,null,null,null,null,null,null,null,null,null,null,1,null,null,null,null,null,null,null,null,"Stechen"]
[null,null,null,null,null,null,null,null,null,null,null,null,null,null,null,null,null,null,null,null,null,1]
[null,null,null,null,null,null,null,null,null,null,null,null,null,null,null,null,null,null,null,null,null,2]
[null,null,null,null,null,null,null,null,null,null,null,null,null,2,null,null,null,null,null,null,null,3]
[]
[]
[null,null,null,null,null,null,null,null,null,null,null,null,null,3,null,null,null,null,null,null,null,"Punkte"]
[]
[null,null,null,null,null,null,null,null,null,null,null,null,null,null,null,null,null,null,null,null,null,"Gesamt"]
[null,null,null,null,null,null,null,null,null,null,null,null,null,"wenn erforderlich"]
[null,null,null,null,null,null,null,null,null,null,null,null,null,4]
[null,null,null,null,null,null,null,null,null,null,null,null,null,null,null,null,null,null,null,null,null,null,"gewonnen"]
[null,null,null,null,null,null,null,null,null,null,null,null,null,null,null,null,null,null,null,null,null,null,"verloren"]
[null,null,null,null,null,null,null,null,null,null,null,null,null,null,"Schreiber:",null,null,null,null,null,"Kontrolle:"]
[]
[]
["1/2 Finale",null,null,null,null,null,{"$f":"MR8_Baum!$G$57","v":"Scheibe: 23"},null,null,null,null,null,null,"1./2. od. 3./4. Platz",null,null,null,null,null,"Scheibe:"]
[null,1,2,"Summe","Punkte","Gesamt",null,null,null,null,null,null,null,null,1,2,"Summe","Punkte","Gesamt"]
[1,null,null,null,null,null,null,null,null,"Stechen",null,null,null,1,null,null,null,null,null,null,null,null,"Stechen"]
[null,null,null,null,null,null,null,null,1,null,null,null,null,null,null,null,null,null,null,null,null,1]
[null,null,null,null,null,null,null,null,2,null,null,null,null,null,null,null,null,null,null,null,null,2]
[2,null,null,null,null,null,null,null,3,null,null,null,null,2,null,null,null,null,null,null,null,3]
[]
[]
[3,null,null,null,null,null,null,null,"Punkte",null,null,null,null,3,null,null,null,null,null,null,null,"Punkte"]
[]
[null,null,null,null,null,null,null,null,"Gesamt",null,null,null,null,null,null,null,null,null,null,null,null,"Gesamt"]
["wenn erforderlich",null,null,null,null,null,null,null,null,null,null,null,null,"wenn erforderlich"]
[4,null,null,null,null,null,null,null,null,null,null,null,null,4]
[null,null,null,null,null,null,null,null,null,"gewonnen",null,null,null,null,null,null,null,null,null,null,null,null,"gewonnen"]
[null,null,null,null,null,null,null,null,null,"verloren",null,null,null,null,null,null,null,null,null,null,null,null,"verloren"]
[null,"Schreiber:",null,null,null,null,null,"Kontrolle:",null,null,null,null,null,null,"Schreiber:",null,null,null,null,null,"Kontrolle:"]
[]
[]
[]
[{"$f":"Select!$C$12","v":"ÖM Indoor 2019"},null,null,null,null,null,null,null,null,null,null,null,null,"Mannschaft:",null,null,{"$f":"MR8_Baum!$C$42","v":"RM_7"}]
["Veranstaltung"]
[{"$f":"Select!$C$13","v":"09.-10. Februar 2019"},null,null,null,null,null,null,null,null,null,null,null,null,"Schützen:",null,null,{"$f":"MR8_Baum!$C$43","v":"Schütze1_RM7 Schütze2_RM7"}]
["Datum"]
["Bewerb:",null,{"$f":"Select!$C$14","v":"Mannschaftsbewerb"},null,null,null,null,null,null,null,null,null,null,"Bogenklasse:",null,null,{"$f":"Select!$C$18","v":"Instinktivbogen Herren"}]
[]
[]
[null,null,null,null,null,null,null,null,null,null,null,null,null,"1/4 Finale",null,null,null,null,null,{"$f":"MR8_Baum!$C$61","v":"Scheibe: 37"}]
[null,null,null,null,null,null,null,null,null,null,null,null,null,null,1,2,"Summe","Punkte","Gesamt"]
[null,null,null,null,null,null,null,null,null,null,null,null,null,1,null,null,null,null,null,null,null,null,"Stechen"]
[null,null,null,null,null,null,null,null,null,null,null,null,null,null,null,null,null,null,null,null,null,1]
[null,null,null,null,null,null,null,null,null,null,null,null,null,null,null,null,null,null,null,null,null,2]
[null,null,null,null,null,null,null,null,null,null,null,null,null,2,null,null,null,null,null,null,null,3]
[]
[]
[null,null,null,null,null,null,null,null,null,null,null,null,null,3,null,null,null,null,null,null,null,"Punkte"]
[]
[null,null,null,null,null,null,null,null,null,null,null,null,null,null,null,null,null,null,null,null,null,"Gesamt"]
[null,null,null,null,null,null,null,null,null,null,null,null,null,"wenn erforderlich"]
[null,null,null,null,null,null,null,null,null,null,null,null,null,4]
[null,null,null,null,null,null,null,null,null,null,null,null,null,null,null,null,null,null,null,null,null,null,"gewonnen"]
[null,null,null,null,null,null,null,null,null,null,null,null,null,null,null,null,null,null,null,null,null,null,"verloren"]
[null,null,null,null,null,null,null,null,null,null,null,null,null,null,"Schreiber:",null,null,null,null,null,"Kontrolle:"]
[]
[]
["1/2 Finale",null,null,null,null,null,{"$f":"MR8_Baum!$G$58","v":"Scheibe: 24"},null,null,null,null,null,null,"1./2. od. 3./4. Platz",null,null,null,null,null,"Scheibe:"]
[null,1,2,"Summe","Punkte","Gesamt",null,null,null,null,null,null,null,null,1,2,"Summe","Punkte","Gesamt"]
[1,null,null,null,null,null,null,null,null,"Stechen",null,null,null,1,null,null,null,null,null,null,null,null,"Stechen"]
[null,null,null,null,null,null,null,null,1,null,null,null,null,null,null,null,null,null,null,null,null,1]
[null,null,null,null,null,null,null,null,2,null,null,null,null,null,null,null,null,null,null,null,null,2]
[2,null,null,null,null,null,null,null,3,null,null,null,null,2,null,null,null,null,null,null,null,3]
[]
[]
[3,null,null,null,null,null,null,null,"Punkte",null,null,null,null,3,null,null,null,null,null,null,null,"Punkte"]
[]
[null,null,null,null,null,null,null,null,"Gesamt",null,null,null,null,null,null,null,null,null,null,null,null,"Gesamt"]
["wenn erforderlich",null,null,null,null,null,null,null,null,null,null,null,null,"wenn erforderlich"]
[4,null,null,null,null,null,null,null,null,null,null,null,null,4]
[null,null,null,null,null,null,null,null,null,"gewonnen",null,null,null,null,null,null,null,null,null,null,null,null,"gewonnen"]
[null,null,null,null,null,null,null,null,null,"verloren",null,null,null,null,null,null,null,null,null,null,null,null,"verloren"]
[null,"Schreiber:",null,null,null,null,null,"Kontrolle:",null,null,null,null,null,null,"Schreiber:",null,null,null,null,null,"Kontrolle:"]
[]
[]
[]
[{"$f":"Select!$C$12","v":"ÖM Indoor 2019"},null,null,null,null,null,null,null,null,null,null,null,null,"Mannschaft:",null,null,{"$f":"MR8_Baum!$C$44","v":"RM_2"}]
["Veranstaltung"]
[{"$f":"Select!$C$13","v":"09.-10. Februar 2019"},null,null,null,null,null,null,null,null,null,null,null,null,"Schützen:",null,null,{"$f":"MR8_Baum!$C$45","v":"Schütze1_RM2 Schütze2_RM2"}]
["Datum"]
["Bewerb:",null,{"$f":"Select!$C$14","v":"Mannschaftsbewerb"},null,null,null,null,null,null,null,null,null,null,"Bogenklasse:",null,null,{"$f":"Select!$C$18","v":"Instinktivbogen Herren"}]
[]
[]
[null,null,null,null,null,null,null,null,null,null,null,null,null,"1/4 Finale",null,null,null,null,null,{"$f":"MR8_Baum!$C$62","v":"Scheibe: 38"}]
[null,null,null,null,null,null,null,null,null,null,null,null,null,null,1,2,"Summe","Punkte","Gesamt"]
[null,null,null,null,null,null,null,null,null,null,null,null,null,1,null,null,null,null,null,null,null,null,"Stechen"]
[null,null,null,null,null,null,null,null,null,null,null,null,null,null,null,null,null,null,null,null,null,1]
[null,null,null,null,null,null,null,null,null,null,null,null,null,null,null,null,null,null,null,null,null,2]
[null,null,null,null,null,null,null,null,null,null,null,null,null,2,null,null,null,null,null,null,null,3]
[]
[]
[null,null,null,null,null,null,null,null,null,null,null,null,null,3,null,null,null,null,null,null,null,"Punkte"]
[]
[null,null,null,null,null,null,null,null,null,null,null,null,null,null,null,null,null,null,null,null,null,"Gesamt"]
[null,null,null,null,null,null,null,null,null,null,null,null,null,"wenn erforderlich"]
[null,null,null,null,null,null,null,null,null,null,null,null,null,4]
[null,null,null,null,null,null,null,null,null,null,null,null,null,null,null,null,null,null,null,null,null,null,"gewonnen"]
[null,null,null,null,null,null,null,null,null,null,null,null,null,null,null,null,null,null,null,null,null,null,"verloren"]
[null,null,null,null,null,null,null,null,null,null,null,null,null,null,"Schreiber:",null,null,null,null,null,"Kontrolle:"]
[]
[]
["1/2 Finale",null,null,null,null,null,{"$f":"MR8_Baum!$G$58","v":"Scheibe: 24"},null,null,null,null,null,null,"1./2. od. 3./4. Platz",null,null,null,null,null,"Scheibe:"]
[null,1,2,"Summe","Punkte","Gesamt",null,null,null,null,null,null,null,null,1,2,"Summe","Punkte","Gesamt"]
[1,null,null,null,null,null,null,null,null,"Stechen",null,null,null,1,null,null,null,null,null,null,null,null,"Stechen"]
[null,null,null,null,null,null,null,null,1,null,null,null,null,null,null,null,null,null,null,null,null,1]
[null,null,null,null,null,null,null,null,2,null,null,null,null,null,null,null,null,null,null,null,null,2]
[2,null,null,null,null,null,null,null,3,null,null,null,null,2,null,null,null,null,null,null,null,3]
[]
[]
[3,null,null,null,null,null,null,null,"Punkte",null,null,null,null,3,null,null,null,null,null,null,null,"Punkte"]
[]
[null,null,null,null,null,null,null,null,"Gesamt",null,null,null,null,null,null,null,null,null,null,null,null,"Gesamt"]
["wenn erforderlich",null,null,null,null,null,null,null,null,null,null,null,null,"wenn erforderlich"]
[4,null,null,null,null,null,null,null,null,null,null,null,null,4]
[null,null,null,null,null,null,null,null,null,"gewonnen",null,null,null,null,null,null,null,null,null,null,null,null,"gewonnen"]
[null,null,null,null,null,null,null,null,null,"verloren",null,null,null,null,null,null,null,null,null,null,null,null,"verloren"]
[null,"Schreiber:",null,null,null,null,null,"Kontrolle:",null,null,null,null,null,null,"Schreiber:",null,null,null,null,null,"Kontrolle:"]

{"sheet":"MR8_Set","index":11,"n_rows":358,"n_cols":17,"rows_kept":358,"cut":false,"hidden":true,"merged":[[1,0,1,7],[1,13,1,17],[2,0,2,7],[3,0,3,7],[3,13,4,17],[4,0,4,7],[13,0,14,0],[13,10,14,10],[27,0,27,5],[27,6,27,8],[27,10,27,15],[27,16,27,18],[5,13,5,17],[9,0,9,5],[9,6,9,8],[9,10,9,15],[9,16,9,18],[11,0,12,0],[11,10,12,10],[17,10,17,15],[20,10,20,15],[36,0,37,0],[46,0,46,7],[46,13,46,17],[47,0,47,7],[48,0,48,7],[48,13,49,17],[49,0,49,7],[29,0,30,0],[29,10,30,10],[31,0,32,0],[31,10,32,10],[74,0,75,0],[74,10,75,10],[76,0,77,0],[76,10,77,10],[72,0,72,5],[72,6,72,8],[72,10,72,15],[72,16,72,18],[50,13,50,17],[54,0,54,5],[54,6,54,8],[54,10,54,15],[54,16,54,18],[56,0,57,0],[56,10,57,10],[58,0,59,0],[58,10,59,10],[62,10,62,15],[65,10,65,15],[95,13,95,17],[99,0,99,5],[99,6,99,8],[99,10,99,15],[99,16,99,18],[81,0,82,0],[81,10,82,10],[91,0,91,7],[91,13,91,17],[92,0,92,7],[93,0,93,7],[93,13,94,17],[94,0,94,7],[83,0,83,5],[83,10,83,15],[103,0,104,0],[103,10,104,10],[117,0,117,5],[117,6,117,8],[117,10,117,15],[108,10,109,10],[117,16,117,18],[101,0,102,0],[101,10,102,10],[107,10,107,15],[110,10,110,15],[207,0,207,5],[207,6,207,8],[207,10,207,15],[200,10,200,15],[207,16,207,18],[185,13,185,17],[189,0,189,5],[189,6,189,8],[189,10,189,15],[189,16,189,18],[198,10,199,10],[195,10,196,10],[197,10,197,15],[193,0,194,0],[193,10,194,10],[209,0,210,0],[209,10,210,10],[211,0,212,0],[211,10,212,10],[216,0,217,0],[213,0,214,0],[216,10,217,10],[213,10,214,10],[215,0,215,5],[215,10,215,15],[252,16,252,18],[230,13,230,17],[234,0,234,5],[234,6,234,8],[234,10,234,15],[234,16,234,18],[242,10,242,15],[245,10,245,15],[226,0,226,7],[226,13,226,17],[227,0,227,7],[228,0,228,7],[228,13,229,17],[229,0,229,7],[297,16,297,18],[308,0,308,5],[308,10,308,15],[306,0,307,0],[303,0,304,0],[275,13,275,17],[279,0,279,5],[279,6,279,8],[279,10,279,15],[279,16,279,18],[287,10,287,15],[290,10,290,15],[305,0,305,5],[305,10,305,15],[299,0,300,0],[306,10,307,10],[303,10,304,10],[288,10,289,10],[285,10,286,10],[342,0,342,5],[342,6,342,8],[342,10,342,15],[316,0,316,7],[316,13,316,17],[317,0,317,7],[318,0,318,7],[318,13,319,17],[319,0,319,7],[342,16,342,18],[326,0,327,0],[326,10,327,10],[332,10,332,15],[335,10,335,15],[320,13,320,17],[324,0,324,5],[324,6,324,8],[324,10,324,15],[324,16,324,18],[152,10,152,15],[155,10,155,15],[35,10,35,15],[38,10,38,15],[35,0,35,5],[38,0,38,5],[80,0,80,5],[80,10,80,15],[60,10,61,10],[78,10,79,10],[78,0,79,0],[105,10,106,10],[140,13,140,17],[144,0,144,5],[144,6,144,8],[144,10,144,15],[144,16,144,18],[136,0,136,7],[136,13,136,17],[123,0,124,0],[119,0,120,0],[119,10,120,10],[121,0,122,0],[121,10,122,10],[181,0,181,7],[181,13,181,17],[182,0,182,7],[183,0,183,7],[183,13,184,17],[184,0,184,7],[162,16,162,18],[173,10,173,15],[191,0,192,0],[191,10,192,10],[162,0,162,5],[162,6,162,8],[162,10,162,15],[123,10,124,10],[350,0,350,5],[350,10,350,15],[353,0,353,5],[353,10,353,15],[15,10,16,10],[18,10,19,10],[33,10,34,10],[36,10,37,10],[33,0,34,0],[63,10,64,10],[263,0,263,5],[263,10,263,15],[281,0,282,0],[281,10,282,10],[283,0,284,0],[283,10,284,10],[218,0,218,5],[218,10,218,15],[236,0,237,0],[236,10,237,10],[173,0,173,5],[170,0,170,5],[170,10,170,15],[125,0,125,5],[125,10,125,15],[171,0,172,0],[168,0,169,0],[171,10,172,10],[168,10,169,10],[153,10,154,10],[150,10,151,10],[137,0,137,7],[138,0,138,7],[138,13,139,17],[139,0,139,7],[126,0,127,0],[126,10,127,10],[164,0,165,0],[164,10,165,10],[166,0,167,0],[166,10,167,10],[148,0,149,0],[148,10,149,10],[128,0,128,5],[128,10,128,15],[146,0,147,0],[146,10,147,10],[274,0,274,7],[260,0,260,5],[260,10,260,15],[254,0,255,0],[254,10,255,10],[256,0,257,0],[256,10,257,10],[238,0,239,0],[238,10,239,10],[252,0,252,5],[252,6,252,8],[252,10,252,15],[258,0,259,0],[261,10,262,10],[258,10,259,10],[243,10,244,10],[240,10,241,10],[351,0,352,0],[351,10,352,10],[333,10,334,10],[330,10,331,10],[261,0,262,0],[346,0,347,0],[346,10,347,10],[348,0,349,0],[348,10,349,10],[299,10,300,10],[301,0,302,0],[301,10,302,10],[297,0,297,5],[297,6,297,8],[297,10,297,15],[271,0,271,7],[271,13,271,17],[272,0,272,7],[273,0,273,7],[273,13,274,17],[344,0,345,0],[344,10,345,10],[328,0,329,0],[328,10,329,10]]}
[]
[{"$f":"Select!$C$12","v":"ÖM Indoor 2019"},null,null,null,null,null,null,null,null,null,"Mannschaft:",null,null,{"$f":"MR8_Baum!$C$6","v":"RM_1"}]
["Veranstaltung"]
[{"$f":"Select!$C$13","v":"09.-10. Februar 2019"},null,null,null,null,null,null,null,null,null,"Schützen:",null,null,{"$f":"MR8_Baum!$C$7","v":"Schütze1_RM1 Schütze2_RM1"}]
["Datum"]
[null,null,null,null,null,null,null,null,null,null,"Bogenklasse:",null,null,{"$f":"Select!$C$18","v":"Instinktivbogen Herren"}]
[]
[]
[]
[null,null,null,null,null,null,null,null,null,null,"1/4 Finale",null,null,null,null,null,{"$f":"MR8_Baum!$C$55","v":"Scheibe: 31"}]
[null,null,null,null,null,null,null,null,null,null,null,1,2,"Summe","Punkte","Gesamt"]
[null,null,null,null,null,null,null,null,null,null,1]
[]
[null,null,null,null,null,null,null,null,null,null,2]
[]
[null,null,null,null,null,null,null,null,null,null,3]
[]
[null,null,null,null,null,null,null,null,null,null,"wenn erforderlich"]
[null,null,null,null,null,null,null,null,null,null,4]
[null,null,null,null,null,null,null,null,null,null,null,null,null,null,null,null,"gewonnen"]
[null,null,null,null,null,null,null,null,null,null,"Stechen wenn erforderlich"]
[null,null,null,null,null,null,null,null,null,null,null,null,null,null,null,null,"verloren"]
[]
[]
[null,null,null,null,null,null,null,null,null,null,null,"Schreiber:",null,null,null,"Kontrolle:"]
[]
[]
["1/2 Finale",null,null,null,null,null,{"$f":"MR8_Baum!$G$55","v":"Scheibe: 21"},null,null,null,"1./2. od. 3./4. Platz",null,null,null,null,null,"Scheibe:"]
[null,1,2,"Summe","Punkte","Gesamt",null,null,null,null,null,1,2,"Summe","Punkte","Gesamt"]
[1,null,null,null,null,null,null,null,null,null,1]
[]
[2,null,null,null,null,null,null,null,null,null,2]
[]
[3,null,null,null,null,null,null,null,null,null,3]
[]
["wenn erforderlich",null,null,null,null,null,null,null,null,null,"wenn erforderlich"]
[4,null,null,null,null,null,null,null,null,null,4]
[null,null,null,null,null,null,"gewonnen",null,null,null,null,null,null,null,null,null,"gewonnen"]
["Stechen wenn erforderlich",null,null,null,null,null,null,null,null,null,"Stechen wenn erforderlich"]
[null,null,null,null,null,null,"verloren",null,null,null,null,null,null,null,null,null,"verloren"]
[]
[]
[null,"Schreiber:",null,null,null,"Kontrolle:",null,null,null,null,null,"Schreiber:",null,null,null,"Kontrolle:"]
[]
[]
[]
[{"$f":"Select!$C$12","v":"ÖM Indoor 2019"},null,null,null,null,null,null,null,null,null,"Mannschaft:",null,null,{"$f":"MR8_Baum!$C$8","v":"RM_8"}]
["Veranstaltung"]
[{"$f":"Select!$C$13","v":"09.-10. Februar 2019"},null,null,null,null,null,null,null,null,null,"Schützen:",null,null,{"$f":"MR8_Baum!$C$9","v":"Schütze1_RM8 Schütze2_RM8"}]
["Datum"]
[null,null,null,null,null,null,null,null,null,null,"Bogenklasse:",null,null,{"$f":"Select!$C$18","v":"Instinktivbogen Herren"}]
[]
[]
[]
[null,null,null,null,null,null,null,null,null,null,"1/4 Finale",null,null,null,null,null,{"$f":"MR8_Baum!$C$56","v":"Scheibe: 32"}]
[null,null,null,null,null,null,null,null,null,null,null,1,2,"Summe","Punkte","Gesamt"]
[null,null,null,null,null,null,null,null,null,null,1]
[]
[null,null,null,null,null,null,null,null,null,null,2]
[]
[null,null,null,null,null,null,null,null,null,null,3]
[]
[null,null,null,null,null,null,null,null,null,null,"wenn erforderlich"]
[null,null,null,null,null,null,null,null,null,null,4]
[null,null,null,null,null,null,null,null,null,null,null,null,null,null,null,null,"gewonnen"]
[null,null,null,null,null,null,null,null,null,null,"Stechen wenn erforderlich"]
[null,null,null,null,null,null,null,null,null,null,null,null,null,null,null,null,"verloren"]
[]
[]
[null,null,null,null,null,null,null,null,null,null,null,"Schreiber:",null,null,null,"Kontrolle:"]
[]
[]
["1/2 Finale",null,null,null,null,null,{"$f":"MR8_Baum!$G$55","v":"Scheibe: 21"},null,null,null,"1./2. od. 3./4. Platz",null,null,null,null,null,"Scheibe:"]
[null,1,2,"Summe","Punkte","Gesamt",null,null,null,null,null,1,2,"Summe","Punkte","Gesamt"]
[1,null,null,null,null,null,null,null,null,null,1]
[]
[2,null,null,null,null,null,null,null,null,null,2]
[]
[3,null,null,null,null,null,null,null,null,null,3]
[]
["wenn erforderlich",null,null,null,null,null,null,null,null,null,"wenn erforderlich"]
[4,null,null,null,null,null,null,null,null,null,4]
[null,null,null,null,null,null,"gewonnen",null,null,null,null,null,null,null,null,null,"gewonnen"]
["Stechen wenn erforderlich",null,null,null,null,null,null,null,null,null,"Stechen wenn erforderlich"]
[null,null,null,null,null,null,"verloren",null,null,null,null,null,null,null,null,null,"verloren"]
[]
[]
[null,"Schreiber:",null,null,null,"Kontrolle:",null,null,null,null,null,"Schreiber:",null,null,null,"Kontrolle:"]
[]
[]
[]
[{"$f":"Select!$C$12","v":"ÖM Indoor 2019"},null,null,null,null,null,null,null,null,null,"Mannschaft:",null,null,{"$f":"MR8_Baum!$C$18","v":"RM_5"}]
["Veranstaltung"]
[{"$f":"Select!$C$13","v":"09.-10. Februar 2019"},null,null,null,null,null,null,null,null,null,"Schützen:",null,null,{"$f":"MR8_Baum!$C$19","v":"Schütze1_RM5 Schütze2_RM5"}]
["Datum"]
[null,null,null,null,null,null,null,null,null,null,"Bogenklasse:",null,null,{"$f":"Select!$C$18","v":"Instinktivbogen Herren"}]
[]
[]
[]
[null,null,null,null,null,null,null,null,null,null,"1/4 Finale",null,null,null,null,null,{"$f":"MR8_Baum!$C$57","v":"Scheibe: 33"}]
[null,null,null,null,null,null,null,null,null,null,null,1,2,"Summe","Punkte","Gesamt"]
[null,null,null,null,null,null,null,null,null,null,1]
[]
[null,null,null,null,null,null,null,null,null,null,2]
[]
[null,null,null,null,null,null,null,null,null,null,3]
[]
[null,null,null,null,null,null,null,null,null,null,"wenn erforderlich"]
[null,null,null,null,null,null,null,null,null,null,4]
[null,null,null,null,null,null,null,null,null,null,null,null,null,null,null,null,"gewonnen"]
[null,null,null,null,null,null,null,null,null,null,"Stechen wenn erforderlich"]
[null,null,null,null,null,null,null,null,null,null,null,null,null,null,null,null,"verloren"]
[]
[]
[null,null,null,null,null,null,null,null,null,null,null,"Schreiber:",null,null,null,"Kontrolle:"]
[]
[]
["1/2 Finale",null,null,null,null,null,{"$f":"MR8_Baum!$G$56","v":"Scheibe: 22"},null,null,null,"1./2. od. 3./4. Platz",null,null,null,null,null,"Scheibe:"]
[null,1,2,"Summe","Punkte","Gesamt",null,null,null,null,null,1,2,"Summe","Punkte","Gesamt"]
[1,null,null,null,null,null,null,null,null,null,1]
[]
[2,null,null,null,null,null,null,null,null,null,2]
[]
[3,null,null,null,null,null,null,null,null,null,3]
[]
["wenn erforderlich",null,null,null,null,null,null,null,null,null,"wenn erforderlich"]
[4,null,null,null,null,null,null,null,null,null,4]
[null,null,null,null,null,null,"gewonnen",null,null,null,null,null,null,null,null,null,"gewonnen"]
["Stechen wenn erforderlich",null,null,null,null,null,null,null,null,null,"Stechen wenn erforderlich"]
[null,null,null,null,null,null,"verloren",null,null,null,null,null,null,null,null,null,"verloren"]
[]
[]
[null,"Schreiber:",null,null,null,"Kontrolle:",null,null,null,null,null,"Schreiber:",null,null,null,"Kontrolle:"]
[]
[]
[]
[{"$f":"Select!$C$12","v":"ÖM Indoor 2019"},null,null,null,null,null,null,null,null,null,"Mannschaft:",null,null,{"$f":"MR8_Baum!$C$20","v":"RM_4"}]
["Veranstaltung"]
[{"$f":"Select!$C$13","v":"09.-10. Februar 2019"},null,null,null,null,null,null,null,null,null,"Schützen:",null,null,{"$f":"MR8_Baum!$C$21","v":"Schütze1_RM4 Schütze2_RM4"}]
["Datum"]
[null,null,null,null,null,null,null,null,null,null,"Bogenklasse:",null,null,{"$f":"Select!$C$18","v":"Instinktivbogen Herren"}]
[]
[]
[]
[null,null,null,null,null,null,null,null,null,null,"1/4 Finale",null,null,null,null,null,{"$f":"MR8_Baum!$C$58","v":"Scheibe: 34"}]
[null,null,null,null,null,null,null,null,null,null,null,1,2,"Summe","Punkte","Gesamt"]
[null,null,null,null,null,null,null,null,null,null,1]
[]
[null,null,null,null,null,null,null,null,null,null,2]
[]
[null,null,null,null,null,null,null,null,null,null,3]
[]
[null,null,null,null,null,null,null,null,null,null,"wenn erforderlich"]
[null,null,null,null,null,null,null,null,null,null,4]
[null,null,null,null,null,null,null,null,null,null,null,null,null,null,null,null,"gewonnen"]
[null,null,null,null,null,null,null,null,null,null,"Stechen wenn erforderlich"]
[null,null,null,null,null,null,null,null,null,null,null,null,null,null,null,null,"verloren"]
[]
[]
[null,null,null,null,null,null,null,null,null,null,null,"Schreiber:",null,null,null,"Kontrolle:"]
[]
[]
["1/2 Finale",null,null,null,null,null,{"$f":"MR8_Baum!$G$56","v":"Scheibe: 22"},null,null,null,"1./2. od. 3./4. Platz",null,null,null,null,null,"Scheibe:"]
[null,1,2,"Summe","Punkte","Gesamt",null,null,null,null,null,1,2,"Summe","Punkte","Gesamt"]
[1,null,null,null,null,null,null,null,null,null,1]
[]
[2,null,null,null,null,null,null,null,null,null,2]
[]
[3,null,null,null,null,null,null,null,null,null,3]
[]
["wenn erforderlich",null,null,null,null,null,null,null,null,null,"wenn erforderlich"]
[4,null,null,null,null,null,null,null,null,null,4]
[null,null,null,null,null,null,"gewonnen",null,null,null,null,null,null,null,null,null,"gewonnen"]
["Stechen wenn erforderlich",null,null,null,null,null,null,null,null,null,"Stechen wenn erforderlich"]
[null,null,null,null,null,null,"verloren",null,null,null,null,null,null,null,null,null,"verloren"]
[]
[]
[null,"Schreiber:",null,null,null,"Kontrolle:",null,null,null,null,null,"Schreiber:",null,null,null,"Kontrolle:"]
[]
[]
[]
[{"$f":"Select!$C$12","v":"ÖM Indoor 2019"},null,null,null,null,null,null,null,null,null,"Mannschaft:",null,null,{"$f":"MR8_Baum!$C$30","v":"RM_3"}]
["Veranstaltung"]
[{"$f":"Select!$C$13","v":"09.-10. Februar 2019"},null,null,null,null,null,null,null,null,null,"Schützen:",null,null,{"$f":"MR8_Baum!$C$31","v":"Schütze1_RM3 Schütze2_RM3"}]
["Datum"]
[null,null,null,null,null,null,null,null,null,null,"Bogenklasse:",null,null,{"$f":"Select!$C$18","v":"Instinktivbogen Herren"}]
[]
[]
[]
[null,null,null,null,null,null,null,null,null,null,"1/4 Finale",null,null,null,null,null,{"$f":"MR8_Baum!$C$59","v":"Scheibe: 35"}]
[null,null,null,null,null,null,null,null,null,null,null,1,2,"Summe","Punkte","Gesamt"]
[null,null,null,null,null,null,null,null,null,null,1]
[]
[null,null,null,null,null,null,null,null,null,null,2]
[]
[null,null,null,null,null,null,null,null,null,null,3]
[]
[null,null,null,null,null,null,null,null,null,null,"wenn erforderlich"]
[null,null,null,null,null,null,null,null,null,null,4]
[null,null,null,null,null,null,null,null,null,null,null,null,null,null,null,null,"gewonnen"]
[null,null,null,null,null,null,null,null,null,null,"Stechen wenn erforderlich"]
[null,null,null,null,null,null,null,null,null,null,null,null,null,null,null,null,"verloren"]
[]
[]
[null,null,null,null,null,null,null,null,null,null,null,"Schreiber:",null,null,null,"Kontrolle:"]
[]
[]
["1/2 Finale",null,null,null,null,null,{"$f":"MR8_Baum!$G$57","v":"Scheibe: 23"},null,null,null,"1./2. od. 3./4. Platz",null,null,null,null,null,"Scheibe:"]
[null,1,2,"Summe","Punkte","Gesamt",null,null,null,null,null,1,2,"Summe","Punkte","Gesamt"]
[1,null,null,null,null,null,null,null,null,null,1]
[]
[2,null,null,null,null,null,null,null,null,null,2]
[]
[3,null,null,null,null,null,null,null,null,null,3]
[]
["wenn erforderlich",null,null,null,null,null,null,null,null,null,"wenn erforderlich"]
[4,null,null,null,null,null,null,null,null,null,4]
[null,null,null,null,null,null,"gewonnen",null,null,null,null,null,null,null,null,null,"gewonnen"]
["Stechen wenn erforderlich",null,null,null,null,null,null,null,null,null,"Stechen wenn erforderlich"]
[null,null,null,null,null,null,"verloren",null,null,null,null,null,null,null,null,null,"verloren"]
[]
[]
[null,"Schreiber:",null,null,null,"Kontrolle:",null,null,null,null,null,"Schreiber:",null,null,null,"Kontrolle:"]
[]
[]
[]
[{"$f":"Select!$C$12","v":"ÖM Indoor 2019"},null,null,null,null,null,null,null,null,null,"Mannschaft:",null,null,{"$f":"MR8_Baum!$C$32","v":"RM_6"}]
["Veranstaltung"]
[{"$f":"Select!$C$13","v":"09.-10. Februar 2019"},null,null,null,null,null,null,null,null,null,"Schützen:",null,null,{"$f":"MR8_Baum!$C$33","v":"Schütze1_RM6 Schütze2_RM6"}]
["Datum"]
[null,null,null,null,null,null,null,null,null,null,"Bogenklasse:",null,null,{"$f":"Select!$C$18","v":"Instinktivbogen Herren"}]
[]
[]
[]
[null,null,null,null,null,null,null,null,null,null,"1/4 Finale",null,null,null,null,null,{"$f":"MR8_Baum!$C$60","v":"Scheibe: 36"}]
[null,null,null,null,null,null,null,null,null,null,null,1,2,"Summe","Punkte","Gesamt"]
[null,null,null,null,null,null,null,null,null,null,1]
[]
[null,null,null,null,null,null,null,null,null,null,2]
[]
[null,null,null,null,null,null,null,null,null,null,3]
[]
[null,null,null,null,null,null,null,null,null,null,"wenn erforderlich"]
[null,null,null,null,null,null,null,null,null,null,4]
[null,null,null,null,null,null,null,null,null,null,null,null,null,null,null,null,"gewonnen"]
[null,null,null,null,null,null,null,null,null,null,"Stechen wenn erforderlich"]
[null,null,null,null,null,null,null,null,null,null,null,null,null,null,null,null,"verloren"]
[]
[]
[null,null,null,null,null,null,null,null,null,null,null,"Schreiber:",null,null,null,"Kontrolle:"]
[]
[]
["1/2 Finale",null,null,null,null,null,{"$f":"MR8_Baum!$G$57","v":"Scheibe: 23"},null,null,null,"1./2. od. 3./4. Platz",null,null,null,null,null,"Scheibe:"]
[null,1,2,"Summe","Punkte","Gesamt",null,null,null,null,null,1,2,"Summe","Punkte","Gesamt"]
[1,null,null,null,null,null,null,null,null,null,1]
[]
[2,null,null,null,null,null,null,null,null,null,2]
[]
[3,null,null,null,null,null,null,null,null,null,3]
[]
["wenn erforderlich",null,null,null,null,null,null,null,null,null,"wenn erforderlich"]
[4,null,null,null,null,null,null,null,null,null,4]
[null,null,null,null,null,null,"gewonnen",null,null,null,null,null,null,null,null,null,"gewonnen"]
["Stechen wenn erforderlich",null,null,null,null,null,null,null,null,null,"Stechen wenn erforderlich"]
[null,null,null,null,null,null,"verloren",null,null,null,null,null,null,null,null,null,"verloren"]
[]
[]
[null,"Schreiber:",null,null,null,"Kontrolle:",null,null,null,null,null,"Schreiber:",null,null,null,"Kontrolle:"]
[]
[]
[]
[{"$f":"Select!$C$12","v":"ÖM Indoor 2019"},null,null,null,null,null,null,null,null,null,"Mannschaft:",null,null,{"$f":"MR8_Baum!$C$42","v":"RM_7"}]
["Veranstaltung"]
[{"$f":"Select!$C$13","v":"09.-10. Februar 2019"},null,null,null,null,null,null,null,null,null,"Schützen:",null,null,{"$f":"MR8_Baum!$C$43","v":"Schütze1_RM7 Schütze2_RM7"}]
["Datum"]
[null,null,null,null,null,null,null,null,null,null,"Bogenklasse:",null,null,{"$f":"Select!$C$18","v":"Instinktivbogen Herren"}]
[]
[]
[]
[null,null,null,null,null,null,null,null,null,null,"1/4 Finale",null,null,null,null,null,{"$f":"MR8_Baum!$C$61","v":"Scheibe: 37"}]
[null,null,null,null,null,null,null,null,null,null,null,1,2,"Summe","Punkte","Gesamt"]
[null,null,null,null,null,null,null,null,null,null,1]
[]
[null,null,null,null,null,null,null,null,null,null,2]
[]
[null,null,null,null,null,null,null,null,null,null,3]
[]
[null,null,null,null,null,null,null,null,null,null,"wenn erforderlich"]
[null,null,null,null,null,null,null,null,null,null,4]
[null,null,null,null,null,null,null,null,null,null,null,null,null,null,null,null,"gewonnen"]
[null,null,null,null,null,null,null,null,null,null,"Stechen wenn erforderlich"]
[null,null,null,null,null,null,null,null,null,null,null,null,null,null,null,null,"verloren"]
[]
[]
[null,null,null,null,null,null,null,null,null,null,null,"Schreiber:",null,null,null,"Kontrolle:"]
[]
[]
["1/2 Finale",null,null,null,null,null,{"$f":"MR8_Baum!$G$58","v":"Scheibe: 24"},null,null,null,"1./2. od. 3./4. Platz",null,null,null,null,null,"Scheibe:"]
[null,1,2,"Summe","Punkte","Gesamt",null,null,null,null,null,1,2,"Summe","Punkte","Gesamt"]
[1,null,null,null,null,null,null,null,null,null,1]
[]
[2,null,null,null,null,null,null,null,null,null,2]
[]
[3,null,null,null,null,null,null,null,null,null,3]
[]
["wenn erforderlich",null,null,null,null,null,null,null,null,null,"wenn erforderlich"]
[4,null,null,null,null,null,null,null,null,null,4]
[null,null,null,null,null,null,"gewonnen",null,null,null,null,null,null,null,null,null,"gewonnen"]
["Stechen wenn erforderlich",null,null,null,null,null,null,null,null,null,"Stechen wenn erforderlich"]
[null,null,null,null,null,null,"verloren",null,null,null,null,null,null,null,null,null,"verloren"]
[]
[]
[null,"Schreiber:",null,null,null,"Kontrolle:",null,null,null,null,null,"Schreiber:",null,null,null,"Kontrolle:"]
[]
[]
[]
[{"$f":"Select!$C$12","v":"ÖM Indoor 2019"},null,null,null,null,null,null,null,null,null,"Mannschaft:",null,null,{"$f":"MR8_Baum!$C$44","v":"RM_2"}]
["Veranstaltung"]
[{"$f":"Select!$C$13","v":"09.-10. Februar 2019"},null,null,null,null,null,null,null,null,null,"Schützen:",null,null,{"$f":"MR8_Baum!$C$45","v":"Schütze1_RM2 Schütze2_RM2"}]
["Datum"]
[null,null,null,null,null,null,null,null,null,null,"Bogenklasse:",null,null,{"$f":"Select!$C$18","v":"Instinktivbogen Herren"}]
[]
[]
[]
[null,null,null,null,null,null,null,null,null,null,"1/4 Finale",null,null,null,null,null,{"$f":"MR8_Baum!$C$62","v":"Scheibe: 38"}]
[null,null,null,null,null,null,null,null,null,null,null,1,2,"Summe","Punkte","Gesamt"]
[null,null,null,null,null,null,null,null,null,null,1]
[]
[null,null,null,null,null,null,null,null,null,null,2]
[]
[null,null,null,null,null,null,null,null,null,null,3]
[]
[null,null,null,null,null,null,null,null,null,null,"wenn erforderlich"]
[null,null,null,null,null,null,null,null,null,null,4]
[null,null,null,null,null,null,null,null,null,null,null,null,null,null,null,null,"gewonnen"]
[null,null,null,null,null,null,null,null,null,null,"Stechen wenn erforderlich"]
[null,null,null,null,null,null,null,null,null,null,null,null,null,null,null,null,"verloren"]
[]
[]
[null,null,null,null,null,null,null,null,null,null,null,"Schreiber:",null,null,null,"Kontrolle:"]
[]
[]
["1/2 Finale",null,null,null,null,null,{"$f":"MR8_Baum!$G$58","v":"Scheibe: 24"},null,null,null,"1./2. od. 3./4. Platz",null,null,null,null,null,"Scheibe:"]
[null,1,2,"Summe","Punkte","Gesamt",null,null,null,null,null,1,2,"Summe","Punkte","Gesamt"]
[1,null,null,null,null,null,null,null,null,null,1]
[]
[2,null,null,null,null,null,null,null,null,null,2]
[]
[3,null,null,null,null,null,null,null,null,null,3]
[]
["wenn erforderlich",null,null,null,null,null,null,null,null,null,"wenn erforderlich"]
[4,null,null,null,null,null,null,null,null,null,4]
[null,null,null,null,null,null,"gewonnen",null,null,null,null,null,null,null,null,null,"gewonnen"]
["Stechen wenn erforderlich",null,null,null,null,null,null,null,null,null,"Stechen wenn erforderlich"]
[null,null,null,null,null,null,"verloren",null,null,null,null,null,null,null,null,null,"verloren"]
[]
[]
[null,"Schreiber:",null,null,null,"Kontrolle:",null,null,null,null,null,"Schreiber:",null,null,null,"Kontrolle:"]

{"sheet":"MRX8","index":12,"n_rows":350,"n_cols":21,"rows_kept":350,"cut":false,"hidden":true,"merged":[[343,0,344,0],[343,12,344,12],[338,0,339,0],[338,12,339,12],[340,0,341,0],[340,12,341,12],[341,7,342,8],[341,19,342,20],[325,12,326,12],[334,0,334,5],[334,6,334,10],[334,12,334,17],[334,18,334,22],[336,0,337,0],[336,12,337,12],[318,0,319,0],[318,12,319,12],[320,0,321,0],[320,12,321,12],[322,12,323,12],[323,19,324,20],[311,0,311,9],[311,15,312,21],[312,0,312,9],[313,15,313,21],[316,0,316,5],[316,6,316,10],[316,12,316,17],[316,18,316,22],[313,2,313,10],[297,19,298,20],[299,0,300,0],[299,12,300,12],[309,0,309,9],[309,15,309,21],[310,0,310,9],[292,0,293,0],[292,12,293,12],[294,0,295,0],[294,12,295,12],[296,0,297,0],[296,12,297,12],[297,7,298,8],[276,0,277,0],[276,12,277,12],[278,12,279,12],[279,19,280,20],[281,12,282,12],[290,0,290,5],[290,6,290,10],[290,12,290,17],[290,18,290,22],[269,15,269,21],[272,0,272,5],[272,6,272,10],[272,12,272,17],[272,18,272,22],[274,0,275,0],[274,12,275,12],[255,0,256,0],[255,12,256,12],[265,0,265,9],[265,15,265,21],[266,0,266,9],[267,0,267,9],[267,15,268,21],[268,0,268,9],[269,2,269,10],[250,0,251,0],[250,12,251,12],[252,0,253,0],[252,12,253,12],[253,7,254,8],[253,19,254,20],[237,12,238,12],[246,0,246,5],[246,6,246,10],[246,12,246,17],[246,18,246,22],[248,0,249,0],[248,12,249,12],[230,0,231,0],[230,12,231,12],[232,0,233,0],[232,12,233,12],[234,12,235,12],[235,19,236,20],[223,0,223,9],[223,15,224,21],[224,0,224,9],[225,15,225,21],[228,0,228,5],[228,6,228,10],[228,12,228,17],[228,18,228,22],[225,2,225,10],[209,19,210,20],[211,0,212,0],[211,12,212,12],[221,0,221,9],[221,15,221,21],[222,0,222,9],[204,0,205,0],[204,12,205,12],[206,0,207,0],[206,12,207,12],[208,0,209,0],[208,12,209,12],[209,7,210,8],[188,0,189,0],[188,12,189,12],[190,12,191,12],[191,19,192,20],[193,12,194,12],[202,0,202,5],[202,6,202,10],[202,12,202,17],[202,18,202,22],[181,15,181,21],[184,0,184,5],[184,6,184,10],[184,12,184,17],[184,18,184,22],[186,0,187,0],[186,12,187,12],[167,0,168,0],[167,12,168,12],[177,0,177,9],[177,15,177,21],[178,0,178,9],[179,0,179,9],[179,15,180,21],[180,0,180,9],[181,2,181,10],[162,0,163,0],[162,12,163,12],[164,0,165,0],[164,12,165,12],[165,7,166,8],[165,19,166,20],[149,12,150,12],[158,0,158,5],[158,6,158,10],[158,12,158,17],[158,18,158,22],[160,0,161,0],[160,12,161,12],[142,0,143,0],[142,12,143,12],[144,0,145,0],[144,12,145,12],[146,12,147,12],[147,19,148,20],[135,0,135,9],[135,15,136,21],[136,0,136,9],[137,15,137,21],[140,0,140,5],[140,6,140,10],[140,12,140,17],[140,18,140,22],[137,2,137,10],[121,19,122,20],[123,0,124,0],[123,12,124,12],[133,0,133,9],[133,15,133,21],[134,0,134,9],[116,0,117,0],[116,12,117,12],[118,0,119,0],[118,12,119,12],[120,0,121,0],[120,12,121,12],[121,7,122,8],[100,0,101,0],[100,12,101,12],[102,12,103,12],[103,19,104,20],[105,12,106,12],[114,0,114,5],[114,6,114,10],[114,12,114,17],[114,18,114,22],[93,15,93,21],[96,0,96,5],[96,6,96,10],[96,12,96,17],[96,18,96,22],[98,0,99,0],[98,12,99,12],[79,0,80,0],[79,12,80,12],[89,0,89,9],[89,15,89,21],[90,0,90,9],[91,0,91,9],[91,15,92,21],[92,0,92,9],[93,2,93,10],[74,0,75,0],[74,12,75,12],[76,0,77,0],[76,12,77,12],[77,7,78,8],[77,19,78,20],[61,12,62,12],[70,0,70,5],[70,6,70,10],[70,12,70,17],[70,18,70,22],[72,0,73,0],[72,12,73,12],[54,0,55,0],[54,12,55,12],[56,0,57,0],[56,12,57,12],[58,12,59,12],[59,19,60,20],[47,0,47,9],[47,15,48,21],[48,0,48,9],[49,15,49,21],[52,0,52,5],[52,6,52,10],[52,12,52,17],[52,18,52,22],[49,2,49,10],[33,19,34,20],[35,0,36,0],[35,12,36,12],[45,0,45,9],[45,15,45,21],[46,0,46,9],[28,0,29,0],[28,12,29,12],[30,0,31,0],[30,12,31,12],[32,0,33,0],[32,12,33,12],[33,7,34,8],[12,0,13,0],[12,12,13,12],[14,12,15,12],[15,19,16,20],[17,12,18,12],[26,0,26,5],[26,6,26,10],[26,12,26,17],[26,18,26,22],[5,15,5,21],[8,0,8,5],[8,6,8,10],[8,12,8,17],[8,18,8,22],[10,0,11,0],[10,12,11,12],[1,0,1,9],[1,15,1,21],[2,0,2,9],[3,0,3,9],[3,15,4,21],[4,0,4,9],[5,2,5,10]]}
[]
[{"$f":"Select!$C$12","v":"ÖM Indoor 2019"},null,null,null,null,null,null,null,null,null,null,null,"Mannschaft:",null,null,{"$f":"MR8_Baum!$C$6","v":"RM_1"}]
["Veranstaltung"]
[{"$f":"Select!$C$13","v":"09.-10. Februar 2019"},null,null,null,null,null,null,null,null,null,null,null,"Schützen:",null,null,{"$f":"MR8_Baum!$C$7","v":"Schütze1_RM1 Schütze2_RM1"}]
["Datum"]
["Bewerb:",null,{"$f":"Select!$C$14","v":"Mannschaftsbewerb"},null,null,null,null,null,null,null,null,null,"Bogenklasse:",null,null,{"$f":"Select!$C$18","v":"Instinktivbogen Herren"}]
[]
[]
[null,null,null,null,null,null,null,null,null,null,null,null,"1/4 Finale",null,null,null,null,null,{"$f":"MR8_Baum!$C$55","v":"Scheibe: 31"}]
[null,null,null,null,null,null,null,null,null,null,null,null,null,1,2,"Summe","Punkte","Gesamt"]
[null,null,null,null,null,null,null,null,null,null,null,null,1]
[]
[null,null,null,null,null,null,null,null,null,null,null,null,2]
[]
[null,null,null,null,null,null,null,null,null,null,null,null,3]
[]
[null,null,null,null,null,null,null,null,null,null,null,null,"wenn erforderlich"]
[null,null,null,null,null,null,null,null,null,null,null,null,4]
[]
[null,null,null,null,null,null,null,null,null,null,null,null,"Stechen wenn erforderlich"]
[null,null,null,null,null,null,null,null,null,null,null,null,null,null,null,null,null,null,null,null,"gewonnen"]
[null,null,null,null,null,null,null,null,null,null,null,null,null,null,null,null,null,null,null,null,"verloren"]
[]
[null,null,null,null,null,null,null,null,null,null,null,null,null,"Schreiber:",null,null,null,null,null,"Kontrolle:"]
[]
[]
["1/2 Finale",null,null,null,null,null,{"$f":"MR8_Baum!$G$55","v":"Scheibe: 21"},null,null,null,null,null,"1./2. od. 3./4. Platz",null,null,null,null,null,"Scheibe:"]
[null,1,2,"Summe","Punkte","Gesamt",null,null,null,null,null,null,null,1,2,"Summe","Punkte","Gesamt"]
[1,null,null,null,null,null,null,null,null,null,null,null,1]
[]
[2,null,null,null,null,null,null,null,null,null,null,null,2]
[]
[3,null,null,null,null,null,null,null,null,null,null,null,3]
[]
["wenn erforderlich",null,null,null,null,null,null,null,null,null,null,null,"wenn erforderlich"]
[4,null,null,null,null,null,null,null,null,null,null,null,4]
[]
["Stechen wenn erforderlich",null,null,null,null,null,null,null,null,null,null,null,"Stechen wenn erforderlich"]
[null,null,null,null,null,null,null,null,"gewonnen",null,null,null,null,null,null,null,null,null,null,null,"gewonnen"]
[null,null,null,null,null,null,null,null,"verloren",null,null,null,null,null,null,null,null,null,null,null,"verloren"]
[]
[null,"Schreiber:",null,null,null,null,null,"Kontrolle:",null,null,null,null,null,"Schreiber:",null,null,null,null,null,"Kontrolle:"]
[]
[]
[]
[{"$f":"Select!$C$12","v":"ÖM Indoor 2019"},null,null,null,null,null,null,null,null,null,null,null,"Mannschaft:",null,null,{"$f":"MR8_Baum!$C$8","v":"RM_8"}]
["Veranstaltung"]
[{"$f":"Select!$C$13","v":"09.-10. Februar 2019"},null,null,null,null,null,null,null,null,null,null,null,"Schützen:",null,null,{"$f":"MR8_Baum!$C$9","v":"Schütze1_RM8 Schütze2_RM8"}]
["Datum"]
["Bewerb:",null,{"$f":"Select!$C$14","v":"Mannschaftsbewerb"},null,null,null,null,null,null,null,null,null,"Bogenklasse:",null,null,{"$f":"Select!$C$18","v":"Instinktivbogen Herren"}]
[]
[]
[null,null,null,null,null,null,null,null,null,null,null,null,"1/4 Finale",null,null,null,null,null,{"$f":"MR8_Baum!$C$56","v":"Scheibe: 32"}]
[null,null,null,null,null,null,null,null,null,null,null,null,null,1,2,"Summe","Punkte","Gesamt"]
[null,null,null,null,null,null,null,null,null,null,null,null,1]
[]
[null,null,null,null,null,null,null,null,null,null,null,null,2]
[]
[null,null,null,null,null,null,null,null,null,null,null,null,3]
[]
[null,null,null,null,null,null,null,null,null,null,null,null,"wenn erforderlich"]
[null,null,null,null,null,null,null,null,null,null,null,null,4]
[]
[null,null,null,null,null,null,null,null,null,null,null,null,"Stechen wenn erforderlich"]
[null,null,null,null,null,null,null,null,null,null,null,null,null,null,null,null,null,null,null,null,"gewonnen"]
[null,null,null,null,null,null,null,null,null,null,null,null,null,null,null,null,null,null,null,null,"verloren"]
[]
[null,null,null,null,null,null,null,null,null,null,null,null,null,"Schreiber:",null,null,null,null,null,"Kontrolle:"]
[]
[]
["1/2 Finale",null,null,null,null,null,{"$f":"MR8_Baum!$G$55","v":"Scheibe: 21"},null,null,null,null,null,"1./2. od. 3./4. Platz",null,null,null,null,null,"Scheibe:"]
[null,1,2,"Summe","Punkte","Gesamt",null,null,null,null,null,null,null,1,2,"Summe","Punkte","Gesamt"]
[1,null,null,null,null,null,null,null,null,null,null,null,1]
[]
[2,null,null,null,null,null,null,null,null,null,null,null,2]
[]
[3,null,null,null,null,null,null,null,null,null,null,null,3]
[]
["wenn erforderlich",null,null,null,null,null,null,null,null,null,null,null,"wenn erforderlich"]
[4,null,null,null,null,null,null,null,null,null,null,null,4]
[]
["Stechen wenn erforderlich",null,null,null,null,null,null,null,null,null,null,null,"Stechen wenn erforderlich"]
[null,null,null,null,null,null,null,null,"gewonnen",null,null,null,null,null,null,null,null,null,null,null,"gewonnen"]
[null,null,null,null,null,null,null,null,"verloren",null,null,null,null,null,null,null,null,null,null,null,"verloren"]
[]
[null,"Schreiber:",null,null,null,null,null,"Kontrolle:",null,null,null,null,null,"Schreiber:",null,null,null,null,null,"Kontrolle:"]
[]
[]
[]
[{"$f":"Select!$C$12","v":"ÖM Indoor 2019"},null,null,null,null,null,null,null,null,null,null,null,"Mannschaft:",null,null,{"$f":"MR8_Baum!$C$18","v":"RM_5"}]
["Veranstaltung"]
[{"$f":"Select!$C$13","v":"09.-10. Februar 2019"},null,null,null,null,null,null,null,null,null,null,null,"Schützen:",null,null,{"$f":"MR8_Baum!$C$19","v":"Schütze1_RM5 Schütze2_RM5"}]
["Datum"]
["Bewerb:",null,{"$f":"Select!$C$14","v":"Mannschaftsbewerb"},null,null,null,null,null,null,null,null,null,"Bogenklasse:",null,null,{"$f":"Select!$C$18","v":"Instinktivbogen Herren"}]
[]
[]
[null,null,null,null,null,null,null,null,null,null,null,null,"1/4 Finale",null,null,null,null,null,{"$f":"MR8_Baum!$C$57","v":"Scheibe: 33"}]
[null,null,null,null,null,null,null,null,null,null,null,null,null,1,2,"Summe","Punkte","Gesamt"]
[null,null,null,null,null,null,null,null,null,null,null,null,1]
[]
[null,null,null,null,null,null,null,null,null,null,null,null,2]
[]
[null,null,null,null,null,null,null,null,null,null,null,null,3]
[]
[null,null,null,null,null,null,null,null,null,null,null,null,"wenn erforderlich"]
[null,null,null,null,null,null,null,null,null,null,null,null,4]
[]
[null,null,null,null,null,null,null,null,null,null,null,null,"Stechen wenn erforderlich"]
[null,null,null,null,null,null,null,null,null,null,null,null,null,null,null,null,null,null,null,null,"gewonnen"]
[null,null,null,null,null,null,null,null,null,null,null,null,null,null,null,null,null,null,null,null,"verloren"]
[]
[null,null,null,null,null,null,null,null,null,null,null,null,null,"Schreiber:",null,null,null,null,null,"Kontrolle:"]
[]
[]
["1/2 Finale",null,null,null,null,null,{"$f":"MR8_Baum!$G$56","v":"Scheibe: 22"},null,null,null,null,null,"1./2. od. 3./4. Platz",null,null,null,null,null,"Scheibe:"]
[null,1,2,"Summe","Punkte","Gesamt",null,null,null,null,null,null,null,1,2,"Summe","Punkte","Gesamt"]
[1,null,null,null,null,null,null,null,null,null,null,null,1]
[]
[2,null,null,null,null,null,null,null,null,null,null,null,2]
[]
[3,null,null,null,null,null,null,null,null,null,null,null,3]
[]
["wenn erforderlich",null,null,null,null,null,null,null,null,null,null,null,"wenn erforderlich"]
[4,null,null,null,null,null,null,null,null,null,null,null,4]
[]
["Stechen wenn erforderlich",null,null,null,null,null,null,null,null,null,null,null,"Stechen wenn erforderlich"]
[null,null,null,null,null,null,null,null,"gewonnen",null,null,null,null,null,null,null,null,null,null,null,"gewonnen"]
[null,null,null,null,null,null,null,null,"verloren",null,null,null,null,null,null,null,null,null,null,null,"verloren"]
[]
[null,"Schreiber:",null,null,null,null,null,"Kontrolle:",null,null,null,null,null,"Schreiber:",null,null,null,null,null,"Kontrolle:"]
[]
[]
[]
[{"$f":"Select!$C$12","v":"ÖM Indoor 2019"},null,null,null,null,null,null,null,null,null,null,null,"Mannschaft:",null,null,{"$f":"MR8_Baum!$C$20","v":"RM_4"}]
["Veranstaltung"]
[{"$f":"Select!$C$13","v":"09.-10. Februar 2019"},null,null,null,null,null,null,null,null,null,null,null,"Schützen:",null,null,{"$f":"MR8_Baum!$C$21","v":"Schütze1_RM4 Schütze2_RM4"}]
["Datum"]
["Bewerb:",null,{"$f":"Select!$C$14","v":"Mannschaftsbewerb"},null,null,null,null,null,null,null,null,null,"Bogenklasse:",null,null,{"$f":"Select!$C$18","v":"Instinktivbogen Herren"}]
[]
[]
[null,null,null,null,null,null,null,null,null,null,null,null,"1/4 Finale",null,null,null,null,null,{"$f":"MR8_Baum!$C$58","v":"Scheibe: 34"}]
[null,null,null,null,null,null,null,null,null,null,null,null,null,1,2,"Summe","Punkte","Gesamt"]
[null,null,null,null,null,null,null,null,null,null,null,null,1]
[]
[null,null,null,null,null,null,null,null,null,null,null,null,2]
[]
[null,null,null,null,null,null,null,null,null,null,null,null,3]
[]
[null,null,null,null,null,null,null,null,null,null,null,null,"wenn erforderlich"]
[null,null,null,null,null,null,null,null,null,null,null,null,4]
[]
[null,null,null,null,null,null,null,null,null,null,null,null,"Stechen wenn erforderlich"]
[null,null,null,null,null,null,null,null,null,null,null,null,null,null,null,null,null,null,null,null,"gewonnen"]
[null,null,null,null,null,null,null,null,null,null,null,null,null,null,null,null,null,null,null,null,"verloren"]
[]
[null,null,null,null,null,null,null,null,null,null,null,null,null,"Schreiber:",null,null,null,null,null,"Kontrolle:"]
[]
[]
["1/2 Finale",null,null,null,null,null,{"$f":"MR8_Baum!$G$56","v":"Scheibe: 22"},null,null,null,null,null,"1./2. od. 3./4. Platz",null,null,null,null,null,"Scheibe:"]
[null,1,2,"Summe","Punkte","Gesamt",null,null,null,null,null,null,null,1,2,"Summe","Punkte","Gesamt"]
[1,null,null,null,null,null,null,null,null,null,null,null,1]
[]
[2,null,null,null,null,null,null,null,null,null,null,null,2]
[]
[3,null,null,null,null,null,null,null,null,null,null,null,3]
[]
["wenn erforderlich",null,null,null,null,null,null,null,null,null,null,null,"wenn erforderlich"]
[4,null,null,null,null,null,null,null,null,null,null,null,4]
[]
["Stechen wenn erforderlich",null,null,null,null,null,null,null,null,null,null,null,"Stechen wenn erforderlich"]
[null,null,null,null,null,null,null,null,"gewonnen",null,null,null,null,null,null,null,null,null,null,null,"gewonnen"]
[null,null,null,null,null,null,null,null,"verloren",null,null,null,null,null,null,null,null,null,null,null,"verloren"]
[]
[null,"Schreiber:",null,null,null,null,null,"Kontrolle:",null,null,null,null,null,"Schreiber:",null,null,null,null,null,"Kontrolle:"]
[]
[]
[]
[{"$f":"Select!$C$12","v":"ÖM Indoor 2019"},null,null,null,null,null,null,null,null,null,null,null,"Mannschaft:",null,null,{"$f":"MR8_Baum!$C$30","v":"RM_3"}]
["Veranstaltung"]
[{"$f":"Select!$C$13","v":"09.-10. Februar 2019"},null,null,null,null,null,null,null,null,null,null,null,"Schützen:",null,null,{"$f":"MR8_Baum!$C$31","v":"Schütze1_RM3 Schütze2_RM3"}]
["Datum"]
["Bewerb:",null,{"$f":"Select!$C$14","v":"Mannschaftsbewerb"},null,null,null,null,null,null,null,null,null,"Bogenklasse:",null,null,{"$f":"Select!$C$18","v":"Instinktivbogen Herren"}]
[]
[]
[null,null,null,null,null,null,null,null,null,null,null,null,"1/4 Finale",null,null,null,null,null,{"$f":"MR8_Baum!$C$59","v":"Scheibe: 35"}]
[null,null,null,null,null,null,null,null,null,null,null,null,null,1,2,"Summe","Punkte","Gesamt"]
[null,null,null,null,null,null,null,null,null,null,null,null,1]
[]
[null,null,null,null,null,null,null,null,null,null,null,null,2]
[]
[null,null,null,null,null,null,null,null,null,null,null,null,3]
[]
[null,null,null,null,null,null,null,null,null,null,null,null,"wenn erforderlich"]
[null,null,null,null,null,null,null,null,null,null,null,null,4]
[]
[null,null,null,null,null,null,null,null,null,null,null,null,"Stechen wenn erforderlich"]
[null,null,null,null,null,null,null,null,null,null,null,null,null,null,null,null,null,null,null,null,"gewonnen"]
[null,null,null,null,null,null,null,null,null,null,null,null,null,null,null,null,null,null,null,null,"verloren"]
[]
[null,null,null,null,null,null,null,null,null,null,null,null,null,"Schreiber:",null,null,null,null,null,"Kontrolle:"]
[]
[]
["1/2 Finale",null,null,null,null,null,{"$f":"MR8_Baum!$G$57","v":"Scheibe: 23"},null,null,null,null,null,"1./2. od. 3./4. Platz",null,null,null,null,null,"Scheibe:"]
[null,1,2,"Summe","Punkte","Gesamt",null,null,null,null,null,null,null,1,2,"Summe","Punkte","Gesamt"]
[1,null,null,null,null,null,null,null,null,null,null,null,1]
[]
[2,null,null,null,null,null,null,null,null,null,null,null,2]
[]
[3,null,null,null,null,null,null,null,null,null,null,null,3]
[]
["wenn erforderlich",null,null,null,null,null,null,null,null,null,null,null,"wenn erforderlich"]
[4,null,null,null,null,null,null,null,null,null,null,null,4]
[]
["Stechen wenn erforderlich",null,null,null,null,null,null,null,null,null,null,null,"Stechen wenn erforderlich"]
[null,null,null,null,null,null,null,null,"gewonnen",null,null,null,null,null,null,null,null,null,null,null,"gewonnen"]
[null,null,null,null,null,null,null,null,"verloren",null,null,null,null,null,null,null,null,null,null,null,"verloren"]
[]
[null,"Schreiber:",null,null,null,null,null,"Kontrolle:",null,null,null,null,null,"Schreiber:",null,null,null,null,null,"Kontrolle:"]
[]
[]
[]
[{"$f":"Select!$C$12","v":"ÖM Indoor 2019"},null,null,null,null,null,null,null,null,null,null,null,"Mannschaft:",null,null,{"$f":"MR8_Baum!$C$32","v":"RM_6"}]
["Veranstaltung"]
[{"$f":"Select!$C$13","v":"09.-10. Februar 2019"},null,null,null,null,null,null,null,null,null,null,null,"Schützen:",null,null,{"$f":"MR8_Baum!$C$33","v":"Schütze1_RM6 Schütze2_RM6"}]
["Datum"]
["Bewerb:",null,{"$f":"Select!$C$14","v":"Mannschaftsbewerb"},null,null,null,null,null,null,null,null,null,"Bogenklasse:",null,null,{"$f":"Select!$C$18","v":"Instinktivbogen Herren"}]
[]
[]
[null,null,null,null,null,null,null,null,null,null,null,null,"1/4 Finale",null,null,null,null,null,{"$f":"MR8_Baum!$C$60","v":"Scheibe: 36"}]
[null,null,null,null,null,null,null,null,null,null,null,null,null,1,2,"Summe","Punkte","Gesamt"]
[null,null,null,null,null,null,null,null,null,null,null,null,1]
[]
[null,null,null,null,null,null,null,null,null,null,null,null,2]
[]
[null,null,null,null,null,null,null,null,null,null,null,null,3]
[]
[null,null,null,null,null,null,null,null,null,null,null,null,"wenn erforderlich"]
[null,null,null,null,null,null,null,null,null,null,null,null,4]
[]
[null,null,null,null,null,null,null,null,null,null,null,null,"Stechen wenn erforderlich"]
[null,null,null,null,null,null,null,null,null,null,null,null,null,null,null,null,null,null,null,null,"gewonnen"]
[null,null,null,null,null,null,null,null,null,null,null,null,null,null,null,null,null,null,null,null,"verloren"]
[]
[null,null,null,null,null,null,null,null,null,null,null,null,null,"Schreiber:",null,null,null,null,null,"Kontrolle:"]
[]
[]
["1/2 Finale",null,null,null,null,null,{"$f":"MR8_Baum!$G$57","v":"Scheibe: 23"},null,null,null,null,null,"1./2. od. 3./4. Platz",null,null,null,null,null,"Scheibe:"]
[null,1,2,"Summe","Punkte","Gesamt",null,null,null,null,null,null,null,1,2,"Summe","Punkte","Gesamt"]
[1,null,null,null,null,null,null,null,null,null,null,null,1]
[]
[2,null,null,null,null,null,null,null,null,null,null,null,2]
[]
[3,null,null,null,null,null,null,null,null,null,null,null,3]
[]
["wenn erforderlich",null,null,null,null,null,null,null,null,null,null,null,"wenn erforderlich"]
[4,null,null,null,null,null,null,null,null,null,null,null,4]
[]
["Stechen wenn erforderlich",null,null,null,null,null,null,null,null,null,null,null,"Stechen wenn erforderlich"]
[null,null,null,null,null,null,null,null,"gewonnen",null,null,null,null,null,null,null,null,null,null,null,"gewonnen"]
[null,null,null,null,null,null,null,null,"verloren",null,null,null,null,null,null,null,null,null,null,null,"verloren"]
[]
[null,"Schreiber:",null,null,null,null,null,"Kontrolle:",null,null,null,null,null,"Schreiber:",null,null,null,null,null,"Kontrolle:"]
[]
[]
[]
[{"$f":"Select!$C$12","v":"ÖM Indoor 2019"},null,null,null,null,null,null,null,null,null,null,null,"Mannschaft:",null,null,{"$f":"MR8_Baum!$C$42","v":"RM_7"}]
["Veranstaltung"]
[{"$f":"Select!$C$13","v":"09.-10. Februar 2019"},null,null,null,null,null,null,null,null,null,null,null,"Schützen:",null,null,{"$f":"MR8_Baum!$C$43","v":"Schütze1_RM7 Schütze2_RM7"}]
["Datum"]
["Bewerb:",null,{"$f":"Select!$C$14","v":"Mannschaftsbewerb"},null,null,null,null,null,null,null,null,null,"Bogenklasse:",null,null,{"$f":"Select!$C$18","v":"Instinktivbogen Herren"}]
[]
[]
[null,null,null,null,null,null,null,null,null,null,null,null,"1/4 Finale",null,null,null,null,null,{"$f":"MR8_Baum!$C$61","v":"Scheibe: 37"}]
[null,null,null,null,null,null,null,null,null,null,null,null,null,1,2,"Summe","Punkte","Gesamt"]
[null,null,null,null,null,null,null,null,null,null,null,null,1]
[]
[null,null,null,null,null,null,null,null,null,null,null,null,2]
[]
[null,null,null,null,null,null,null,null,null,null,null,null,3]
[]
[null,null,null,null,null,null,null,null,null,null,null,null,"wenn erforderlich"]
[null,null,null,null,null,null,null,null,null,null,null,null,4]
[]
[null,null,null,null,null,null,null,null,null,null,null,null,"Stechen wenn erforderlich"]
[null,null,null,null,null,null,null,null,null,null,null,null,null,null,null,null,null,null,null,null,"gewonnen"]
[null,null,null,null,null,null,null,null,null,null,null,null,null,null,null,null,null,null,null,null,"verloren"]
[]
[null,null,null,null,null,null,null,null,null,null,null,null,null,"Schreiber:",null,null,null,null,null,"Kontrolle:"]
[]
[]
["1/2 Finale",null,null,null,null,null,{"$f":"MR8_Baum!$G$58","v":"Scheibe: 24"},null,null,null,null,null,"1./2. od. 3./4. Platz",null,null,null,null,null,"Scheibe:"]
[null,1,2,"Summe","Punkte","Gesamt",null,null,null,null,null,null,null,1,2,"Summe","Punkte","Gesamt"]
[1,null,null,null,null,null,null,null,null,null,null,null,1]
[]
[2,null,null,null,null,null,null,null,null,null,null,null,2]
[]
[3,null,null,null,null,null,null,null,null,null,null,null,3]
[]
["wenn erforderlich",null,null,null,null,null,null,null,null,null,null,null,"wenn erforderlich"]
[4,null,null,null,null,null,null,null,null,null,null,null,4]
[]
["Stechen wenn erforderlich",null,null,null,null,null,null,null,null,null,null,null,"Stechen wenn erforderlich"]
[null,null,null,null,null,null,null,null,"gewonnen",null,null,null,null,null,null,null,null,null,null,null,"gewonnen"]
[null,null,null,null,null,null,null,null,"verloren",null,null,null,null,null,null,null,null,null,null,null,"verloren"]
[]
[null,"Schreiber:",null,null,null,null,null,"Kontrolle:",null,null,null,null,null,"Schreiber:",null,null,null,null,null,"Kontrolle:"]
[]
[]
[]
[{"$f":"Select!$C$12","v":"ÖM Indoor 2019"},null,null,null,null,null,null,null,null,null,null,null,"Mannschaft:",null,null,{"$f":"MR8_Baum!$C$44","v":"RM_2"}]
["Veranstaltung"]
[{"$f":"Select!$C$13","v":"09.-10. Februar 2019"},null,null,null,null,null,null,null,null,null,null,null,"Schützen:",null,null,{"$f":"MR8_Baum!$C$45","v":"Schütze1_RM2 Schütze2_RM2"}]
["Datum"]
["Bewerb:",null,{"$f":"Select!$C$14","v":"Mannschaftsbewerb"},null,null,null,null,null,null,null,null,null,"Bogenklasse:",null,null,{"$f":"Select!$C$18","v":"Instinktivbogen Herren"}]
[]
[]
[null,null,null,null,null,null,null,null,null,null,null,null,"1/4 Finale",null,null,null,null,null,{"$f":"MR8_Baum!$C$62","v":"Scheibe: 38"}]
[null,null,null,null,null,null,null,null,null,null,null,null,null,1,2,"Summe","Punkte","Gesamt"]
[null,null,null,null,null,null,null,null,null,null,null,null,1]
[]
[null,null,null,null,null,null,null,null,null,null,null,null,2]
[]
[null,null,null,null,null,null,null,null,null,null,null,null,3]
[]
[null,null,null,null,null,null,null,null,null,null,null,null,"wenn erforderlich"]
[null,null,null,null,null,null,null,null,null,null,null,null,4]
[]
[null,null,null,null,null,null,null,null,null,null,null,null,"Stechen wenn erforderlich"]
[null,null,null,null,null,null,null,null,null,null,null,null,null,null,null,null,null,null,null,null,"gewonnen"]
[null,null,null,null,null,null,null,null,null,null,null,null,null,null,null,null,null,null,null,null,"verloren"]
[]
[null,null,null,null,null,null,null,null,null,null,null,null,null,"Schreiber:",null,null,null,null,null,"Kontrolle:"]
[]
[]
["1/2 Finale",null,null,null,null,null,{"$f":"MR8_Baum!$G$58","v":"Scheibe: 24"},null,null,null,null,null,"1./2. od. 3./4. Platz",null,null,null,null,null,"Scheibe:"]
[null,1,2,"Summe","Punkte","Gesamt",null,null,null,null,null,null,null,1,2,"Summe","Punkte","Gesamt"]
[1,null,null,null,null,null,null,null,null,null,null,null,1]
[]
[2,null,null,null,null,null,null,null,null,null,null,null,2]
[]
[3,null,null,null,null,null,null,null,null,null,null,null,3]
[]
["wenn erforderlich",null,null,null,null,null,null,null,null,null,null,null,"wenn erforderlich"]
[4,null,null,null,null,null,null,null,null,null,null,null,4]
[]
["Stechen wenn erforderlich",null,null,null,null,null,null,null,null,null,null,null,"Stechen wenn erforderlich"]
[null,null,null,null,null,null,null,null,"gewonnen",null,null,null,null,null,null,null,null,null,null,null,"gewonnen"]
[null,null,null,null,null,null,null,null,"verloren",null,null,null,null,null,null,null,null,null,null,null,"verloren"]
[]
[null,"Schreiber:",null,null,null,null,null,"Kontrolle:",null,null,null,null,null,"Schreiber:",null,null,null,null,null,"Kontrolle:"]

{"sheet":"MR8_Ergebnis","index":13,"n_rows":17,"n_cols":15,"rows_kept":17,"cut":false,"hidden":true,"merged":[[6,9,6,15],[6,0,6,3],[2,0,2,3],[1,0,1,3],[4,0,4,7],[1,4,1,7]]}
[]
[{"$f":"Select!$C$12","v":"ÖM Indoor 2019"}]
[{"$f":"Select!C13","v":"09.-10. Februar 2019"}]
[]
["Ergebnisliste"]
[]
[{"$f":"CONCATENATE(Select!C14,\" \",Select!C18)","v":"Mannschaftsbewerb Instinktivbogen Herren"},null,null,null,null,null,null,null,null,"!!!!!!!!!!!!!!!!!!!!!!!!!!  SORTIERBEREICH - NICHT ENTFERNEN !!!!!!!!!!!!!!!!!!!!!!!!!!"]
[]
["Pl.",null,"Mannschaft","Schützen","Quali.","1/4","1/2","Finale",null,"SortMannschaft","SortSchützen","SortQuali","Sort1/4","Sort1/2","SortFinale"]
[{"$f":"IF(C10<>\"\",1,\"\")","v":""},null,null,null,null,null,null,null,null,{"$f":"IF(MR8_Baum!$L$21>MR8_Baum!$L$23,MR8_Baum!$K$21,IF(MR8_Baum!$L$23>MR8_Baum!$L$21,MR8_Baum!$K$23,IF(RIGHT(MR8_Baum!$L$21,1)=\"*\",MR8_Baum!$K$21,IF(RIGHT(MR8_Baum!$L$23,1)=\"*\",MR8_Baum!$K$23,\"\"))))","v":""},{"$f":"IF(MR8_Baum!$L$21>MR8_Baum!$L$23,MR8_Baum!$K$22,IF(MR8_Baum!$L$23>MR8_Baum!$L$21,MR8_Baum!$K$24,IF(RIGHT(MR8_Baum!$L$21,1)=\"*\",MR8_Baum!$K$22,IF(RIGHT(MR8_Baum!$L$23,1)=\"*\",MR8_Baum!$K$24,\"\"))))","v":""},{"$f":"VLOOKUP(J10,MR_Quali!$C$10:$G$29,5,FALSE)","v":{"$error":"#N/A"}},{"$f":"VLOOKUP(J10,MR8_Baum!$C$6:$D$45,2,FALSE)","v":{"$error":"#N/A"}},{"$f":"VLOOKUP(J10,MR8_Baum!$G$12:$H$39,2,FALSE)","v":0},{"$f":"VLOOKUP(J10,MR8_Baum!$K$21:$L$30,2,FALSE)","v":0}]
[{"$f":"IF(C11<>\"\",A10+1,\"\")","v":""},null,null,null,null,null,null,null,null,{"$f":"IF(MR8_Baum!$L$21<MR8_Baum!$L$23,MR8_Baum!$K$21,IF(MR8_Baum!$L$23<MR8_Baum!$L$21,MR8_Baum!$K$23,IF(RIGHT(MR8_Baum!$L$21,1)=\"*\",MR8_Baum!$K$23,IF(RIGHT(MR8_Baum!$L$23,1)=\"*\",MR8_Baum!$K$21,\"\"))))","v":""},{"$f":"IF(MR8_Baum!$L$21<MR8_Baum!$L$23,MR8_Baum!$K$22,IF(MR8_Baum!$L$23<MR8_Baum!$L$21,MR8_Baum!$K$24,IF(RIGHT(MR8_Baum!$L$21,1)=\"*\",MR8_Baum!$K$24,IF(RIGHT(MR8_Baum!$L$23,1)=\"*\",MR8_Baum!$K$22,\"\"))))","v":""},{"$f":"VLOOKUP(J11,MR_Quali!$C$10:$G$29,5,FALSE)","v":{"$error":"#N/A"}},{"$f":"VLOOKUP(J11,MR8_Baum!$C$6:$D$45,2,FALSE)","v":{"$error":"#N/A"}},{"$f":"VLOOKUP(J11,MR8_Baum!$G$12:$H$39,2,FALSE)","v":0},{"$f":"VLOOKUP(J11,MR8_Baum!$K$21:$L$30,2,FALSE)","v":0}]
["",null,null,null,null,null,null,null,null,{"$f":"IF(MR8_Baum!$L$27>MR8_Baum!$L$29,MR8_Baum!$K$27,IF(MR8_Baum!$L$29>MR8_Baum!$L$27,MR8_Baum!$K$29,IF(RIGHT(MR8_Baum!$L$27,1)=\"*\",MR8_Baum!$K$27,IF(RIGHT(MR8_Baum!$L$29,1)=\"*\",MR8_Baum!$K$29,\"\"))))","v":""},{"$f":"IF(MR8_Baum!$L$27>MR8_Baum!$L$29,MR8_Baum!$K$28,IF(MR8_Baum!$L$29>MR8_Baum!$L$27,MR8_Baum!$K$30,IF(RIGHT(MR8_Baum!$L$27,1)=\"*\",MR8_Baum!$K$28,IF(RIGHT(MR8_Baum!$L$29,1)=\"*\",MR8_Baum!$K$30,\"\"))))","v":""},{"$f":"VLOOKUP(J12,MR_Quali!$C$10:$G$29,5,FALSE)","v":{"$error":"#N/A"}},{"$f":"VLOOKUP(J12,MR8_Baum!$C$6:$D$45,2,FALSE)","v":{"$error":"#N/A"}},{"$f":"VLOOKUP(J12,MR8_Baum!$G$12:$H$39,2,FALSE)","v":0},{"$f":"VLOOKUP(J12,MR8_Baum!$K$21:$L$30,2,FALSE)","v":0}]
["",null,null,null,null,null,null,null,null,{"$f":"IF(MR8_Baum!$L$27<MR8_Baum!$L$29,MR8_Baum!$K$27,IF(MR8_Baum!$L$29<MR8_Baum!$L$27,MR8_Baum!$K$29,IF(RIGHT(MR8_Baum!$L$27,1)=\"*\",MR8_Baum!$K$29,IF(RIGHT(MR8_Baum!$L$29,1)=\"*\",MR8_Baum!$K$27,\"\"))))","v":""},{"$f":"IF(MR8_Baum!$L$27<MR8_Baum!$L$29,MR8_Baum!$K$28,IF(MR8_Baum!$L$29<MR8_Baum!$L$27,MR8_Baum!$K$30,IF(RIGHT(MR8_Baum!$L$27,1)=\"*\",MR8_Baum!$K$30,IF(RIGHT(MR8_Baum!$L$29,1)=\"*\",MR8_Baum!$K$28,\"\"))))","v":""},{"$f":"VLOOKUP(J13,MR_Quali!$C$10:$G$29,5,FALSE)","v":{"$error":"#N/A"}},{"$f":"VLOOKUP(J13,MR8_Baum!$C$6:$D$45,2,FALSE)","v":{"$error":"#N/A"}},{"$f":"VLOOKUP(J13,MR8_Baum!$G$12:$H$39,2,FALSE)","v":0},{"$f":"VLOOKUP(J13,MR8_Baum!$K$21:$L$30,2,FALSE)","v":0}]
["",null,null,null,null,null,null,null,null,{"$f":"IF(MR8_Baum!$D$6<MR8_Baum!$D$8,MR8_Baum!$C$6,IF(MR8_Baum!$D$8<MR8_Baum!$D$6,MR8_Baum!$C$8,IF(RIGHT(MR8_Baum!$D$6,1)=\"*\",MR8_Baum!$C$8,IF(RIGHT(MR8_Baum!$D$8,1)=\"*\",MR8_Baum!$C$6,\"\"))))","v":""},{"$f":"IF(MR8_Baum!$D$6<MR8_Baum!$D$8,MR8_Baum!$C$7,IF(MR8_Baum!$D$8<MR8_Baum!$D$6,MR8_Baum!$C$9,IF(RIGHT(MR8_Baum!$D$6,1)=\"*\",MR8_Baum!$C$9,IF(RIGHT(MR8_Baum!$D$8,1)=\"*\",MR8_Baum!$C$7,\"\"))))","v":""},{"$f":"VLOOKUP(J14,MR_Quali!$C$10:$G$29,5,FALSE)","v":{"$error":"#N/A"}},{"$f":"VLOOKUP(J14,MR8_Baum!$C$6:$D$45,2,FALSE)","v":{"$error":"#N/A"}}]
["",null,null,null,null,null,null,null,null,{"$f":"IF(MR8_Baum!$D$18<MR8_Baum!$D$20,MR8_Baum!$C$18,IF(MR8_Baum!$D$20<MR8_Baum!$D$18,MR8_Baum!$C$20,IF(RIGHT(MR8_Baum!$D$18,1)=\"*\",MR8_Baum!$C$20,IF(RIGHT(MR8_Baum!$D$20,1)=\"*\",MR8_Baum!$C$18,\"\"))))","v":""},{"$f":"IF(MR8_Baum!$D$18<MR8_Baum!$D$20,MR8_Baum!$C$19,IF(MR8_Baum!$D$20<MR8_Baum!$D$18,MR8_Baum!$C$21,IF(RIGHT(MR8_Baum!$D$18,1)=\"*\",MR8_Baum!$C$21,IF(RIGHT(MR8_Baum!$D$20,1)=\"*\",MR8_Baum!$C$19,\"\"))))","v":""},{"$f":"VLOOKUP(J15,MR_Quali!$C$10:$G$29,5,FALSE)","v":{"$error":"#N/A"}},{"$f":"VLOOKUP(J15,MR8_Baum!$C$6:$D$45,2,FALSE)","v":{"$error":"#N/A"}}]
["",null,null,null,null,null,null,null,null,{"$f":"IF(MR8_Baum!$D$30<MR8_Baum!$D$32,MR8_Baum!$C$30,IF(MR8_Baum!$D$32<MR8_Baum!$D$30,MR8_Baum!$C$32,IF(RIGHT(MR8_Baum!$D$30,1)=\"*\",MR8_Baum!$C$32,IF(RIGHT(MR8_Baum!$D$32,1)=\"*\",MR8_Baum!$C$30,\"\"))))","v":""},{"$f":"IF(MR8_Baum!$D$30<MR8_Baum!$D$32,MR8_Baum!$C$31,IF(MR8_Baum!$D$32<MR8_Baum!$D$30,MR8_Baum!$C$33,IF(RIGHT(MR8_Baum!$D$30,1)=\"*\",MR8_Baum!$C$33,IF(RIGHT(MR8_Baum!$D$32,1)=\"*\",MR8_Baum!$C$31,\"\"))))","v":""},{"$f":"VLOOKUP(J16,MR_Quali!$C$10:$G$29,5,FALSE)","v":{"$error":"#N/A"}},{"$f":"VLOOKUP(J16,MR8_Baum!$C$6:$D$45,2,FALSE)","v":{"$error":"#N/A"}}]
["",null,null,null,null,null,null,null,null,{"$f":"IF(MR8_Baum!$D$42<MR8_Baum!$D$44,MR8_Baum!$C$42,IF(MR8_Baum!$D$44<MR8_Baum!$D$42,MR8_Baum!$C$44,IF(RIGHT(MR8_Baum!$D$42,1)=\"*\",MR8_Baum!$C$44,IF(RIGHT(MR8_Baum!$D$44,1)=\"*\",MR8_Baum!$C$42,\"\"))))","v":""},{"$f":"IF(MR8_Baum!$D$42<MR8_Baum!$D$44,MR8_Baum!$C$43,IF(MR8_Baum!$D$44<MR8_Baum!$D$42,MR8_Baum!$C$45,IF(RIGHT(MR8_Baum!$D$42,1)=\"*\",MR8_Baum!$C$45,IF(RIGHT(MR8_Baum!$D$44,1)=\"*\",MR8_Baum!$C$43,\"\"))))","v":""},{"$f":"VLOOKUP(J17,MR_Quali!$C$10:$G$29,5,FALSE)","v":{"$error":"#N/A"}},{"$f":"VLOOKUP(J17,MR8_Baum!$C$6:$D$45,2,FALSE)","v":{"$error":"#N/A"}}]

{"sheet":"MC_Quali","index":14,"n_rows":36,"n_cols":8,"rows_kept":36,"cut":false,"hidden":true,"merged":[[1,0,1,3],[2,0,2,3],[4,0,4,3],[6,0,6,3]]}
[]
[{"$f":"Select!$C$12","v":"ÖM Indoor 2019"}]
[{"$f":"Select!C13","v":"09.-10. Februar 2019"}]
[]
["Qualifikationsrunde"]
[]
[{"$f":"CONCATENATE(Select!C14,\" \",Select!C20)","v":"Mannschaftsbewerb Compound Damen"}]
[]
["Pl.","Start-Nr.","Name","Schützen","10er","9er","Quali.","SO"]
[{"$f":"IF(C10>\" \",1,\"\")","v":1},null,"CM_1","Schütze1_CM1 Schütze2_CM1",21,25,632]
[{"$f":"IF(C11>\" \",A10+1,\"\")","v":2},null,"CM_2","Schütze1_CM2 Schütze2_CM2",20,24,631]
[{"$f":"IF(C12>\" \",A11+1,\"\")","v":3},null,"CM_3","Schütze1_CM3 Schütze2_CM3",19,23,630]
[4,null,"CM_4","Schütze1_CM4 Schütze2_CM4",18,22,629]
[5,null,"CM_5","Schütze1_CM5 Schütze2_CM5",17,21,628]
[6,null,"CM_6","Schütze1_CM6 Schütze2_CM6",16,20,627]
[7,null,"CM_7","Schütze1_CM7 Schütze2_CM7",15,19,626]
[8,null,"CM_8","Schütze1_CM8 Schütze2_CM8",14,18,625]
[9,null,"CM_9","Schütze1_CM9 Schütze2_CM9",13,17,624]
[10,null,"CM_10","Schütze1_CM10 Schütze2_CM10",12,16,623]
[11,null,"CM_11","Schütze1_CM11 Schütze2_CM11",11,15,622]
[12,null,"CM_12","Schütze1_CM12  Schütze2_CM12",10,14,621]
[13,null,"CM_13","Schütze1_CM13  Schütze2_CM13 ",9,13,620]
[14,null,"CM_14","Schütze1_CM14 Schütze2_CM14 ",8,12,619]
[15,null,"CM_15","Schütze1_CM15 Schütze2_CM15",7,11,618]
[16,null,"CM_16","Schütze1_CM16  Schütze2_CM16",6,10,617]
[17,null,"CM_17","Schütze1_CM17  Schütze2_CM17",5,9,616]
[18,null,"CM_18","Schütze1_CM18  Schütze2_CM18",4,8,615]
[19,null,"CM_19","Schütze1_CM19  Schütze2_CM19",3,7,614]
[20,null,"CM_20","Schütze1_CM20  Schütze2_CM20 ",2,6,613]
[21,null,"CM_21","Schütze1_CM21  Schütze2_CM21",1,5,612]
[22,null,"CM_22","Schütze1_CM22  Schütze2_CM22",0,4,611]
[23,null,"CM_23","Schütze1_CM23  Schütze2_CM23",1,3,610]
[24,null,"CM_24","Schütze1_CM24  Schütze2_CM24",2,2,609]
[25,null,"CM_25","Schütze1_CM25  Schütze2_CM25",3,1,608]
[26,null,"CM_26","Schütze1_CM26  Schütze2_CM26",4,0,607]
[27,null,"CM_27","Schütze1_CM27  Schütze2_CM27",5,1,606]

{"sheet":"MC16_Baum","index":15,"n_rows":70,"n_cols":16,"rows_kept":70,"cut":false,"hidden":true,"merged":[[1,10,2,15],[2,1,3,1],[3,10,4,15],[4,1,5,1],[5,5,6,5],[6,13,7,13],[6,14,6,15],[7,5,8,5],[7,14,7,15],[8,1,9,1],[8,13,9,13],[8,14,8,15],[9,14,9,15],[10,1,11,1],[10,13,11,13],[10,14,10,15],[11,9,12,9],[11,14,11,15],[28,1,29,1],[28,13,29,13],[29,5,30,5],[13,9,14,9],[14,1,15,1],[16,1,17,1],[17,5,18,5],[19,5,20,5],[20,1,21,1],[20,13,21,13],[22,1,23,1],[22,13,23,13],[26,1,27,1],[26,13,27,13],[31,5,32,5],[32,1,33,1],[34,1,35,1],[35,9,36,9],[37,9,38,9],[38,1,39,1],[49,2,50,3],[38,14,39,15],[40,1,41,1],[41,5,42,5],[41,10,42,11],[43,5,44,5],[44,1,45,1],[46,1,47,1],[47,6,48,7],[45,11,46,15]]}
[]
[null,"Schb","Name","Erg.",null,null,null,null,null,null,{"$f":"Select!C12","v":"ÖM Indoor 2019"}]
[null,{"$f":"D55","v":51},{"$f":"MC_Quali!C10","v":"CM_1"}]
[1,null,{"$f":"MC_Quali!D10","v":"Schütze1_CM1 Schütze2_CM1"},{"$f":"MC_Quali!G10","v":632},"Quali.",null,null,null,null,null,{"$f":"Select!C13","v":"09.-10. Februar 2019"}]
[16,{"$f":"D56","v":52},{"$f":"MC_Quali!C25","v":"CM_16"},null,null,"Schb","Name","Erg."]
[null,null,{"$f":"MC_Quali!D25","v":"Schütze1_CM16  Schütze2_CM16"},{"$f":"MC_Quali!G25","v":617},"Quali.",{"$f":"H55","v":41},{"$f":"IF($D3>$D5,$C3,IF($D5>$D3,$C5,IF(RIGHT($D3,1)=\"*\",$C3,IF(RIGHT($D5,1)=\"*\",$C5,\"\"))))","v":""}]
[null,null,null,null,null,null,{"$f":"IF($D3>$D5,$C4,IF($D5>$D3,$C6,IF(RIGHT($D3,1)=\"*\",$C4,IF(RIGHT($D5,1)=\"*\",$C6,\"\"))))","v":""},null,null,null,null,null,null,"1.",{"$f":"IF($P$21>$P$23,$O$21,IF($P$23>$P$21,$O$23,IF(RIGHT($P$21,1)=\"*\",$O$21,IF(RIGHT($P$23,1)=\"*\",$O$23,\"\"))))","v":""}]
[null,null,null,null,null,{"$f":"H56","v":42},{"$f":"IF($D9>$D11,$C9,IF($D11>$D9,$C11,IF(RIGHT($D9,1)=\"*\",$C9,IF(RIGHT($D11,1)=\"*\",$C11,\"\"))))","v":""},null,null,null,null,null,null,null,{"$f":"IF($P$21>$P$23,$O$22,IF($P$23>$P$21,$O$24,IF(RIGHT($P$21,1)=\"*\",$O$22,IF(RIGHT($P$23,1)=\"*\",$O$24,\"\"))))","v":""}]
[null,{"$f":"D57","v":53},{"$f":"MC_Quali!C18","v":"CM_9"},null,null,null,{"$f":"IF($D9>$D11,$C10,IF($D11>$D9,$C12,IF(RIGHT($D9,1)=\"*\",$C10,IF(RIGHT($D11,1)=\"*\",$C12,\"\"))))","v":""},null,null,null,null,null,null,"2.",{"$f":"IF($P$21<$P$23,$O$21,IF($P$23<$P$21,$O$23,IF(RIGHT($P$21,1)=\"\",$O$21,IF(RIGHT($P$23,1)=\"\",$O$23,\"\"))))","v":""}]
[9,null,{"$f":"MC_Quali!D18","v":"Schütze1_CM9 Schütze2_CM9"},{"$f":"MC_Quali!G18","v":624},"Quali.",null,null,null,null,null,null,null,null,null,{"$f":"IF($P$21<$P$23,$O$22,IF($P$23<$P$21,$O$24,IF(RIGHT($P$21,1)=\"\",$O$22,IF(RIGHT($P$23,1)=\"\",$O$24,\"\"))))","v":""}]
[8,{"$f":"D58","v":54},{"$f":"MC_Quali!C17","v":"CM_8"},null,null,null,null,null,null,"Schb","Name","Erg.",null,"3.",{"$f":"IF($P$27>$P$29,$O$27,IF($P$29>$P$27,$O$29,IF(RIGHT($P$27,1)=\"*\",$O$27,IF(RIGHT($P$29,1)=\"*\",$O$29,\"\"))))","v":""}]
[null,null,{"$f":"MC_Quali!D17","v":"Schütze1_CM8 Schütze2_CM8"},{"$f":"MC_Quali!G17","v":625},"Quali.",null,null,null,null,{"$f":"L55","v":31},{"$f":"IF($H6>$H8,$G6,IF($H8>$H6,$G8,IF(RIGHT($H6,1)=\"*\",$G6,IF(RIGHT($H8,1)=\"*\",$G8,\"\"))))","v":""},null,null,null,{"$f":"IF($P$27>$P$29,$O$28,IF($P$29>$P$27,$O$30,IF(RIGHT($P$27,1)=\"*\",$O$28,IF(RIGHT($P$29,1)=\"*\",$O$30,\"\"))))","v":""}]
[null,null,null,null,null,null,null,null,null,null,{"$f":"IF($H6>$H8,$G7,IF($H8>$H6,$G9,IF(RIGHT($H6,1)=\"*\",$G7,IF(RIGHT($H8,1)=\"*\",$G9,\"\"))))","v":""}]
[null,null,null,null,null,null,null,null,null,{"$f":"L56","v":32},{"$f":"IF($H18>$H20,$G18,IF($H20>$H18,$G20,IF(RIGHT($H18,1)=\"*\",$G18,IF(RIGHT($H20,1)=\"*\",$G20,\"\"))))","v":""}]
[null,{"$f":"D59","v":55},{"$f":"MC_Quali!C14","v":"CM_5"},null,null,null,null,null,null,null,{"$f":"IF($H18>$H20,$G19,IF($H20>$H18,$G21,IF(RIGHT($H18,1)=\"*\",$G19,IF(RIGHT($H20,1)=\"*\",$G21,\"\"))))","v":""}]
[5,null,{"$f":"MC_Quali!D14","v":"Schütze1_CM5 Schütze2_CM5"},{"$f":"MC_Quali!G14","v":628},"Quali."]
[12,{"$f":"D60","v":56},{"$f":"MC_Quali!C21","v":"CM_12"}]
[null,null,{"$f":"MC_Quali!D21","v":"Schütze1_CM12  Schütze2_CM12"},{"$f":"MC_Quali!G23","v":619},"Quali.",{"$f":"H57","v":43},{"$f":"IF($D15>$D17,$C15,IF($D17>$D15,$C17,IF(RIGHT($D15,1)=\"*\",$C15,IF(RIGHT($D17,1)=\"*\",$C17,\"\"))))","v":""},null,null,null,null,null,null,null,""]
[null,null,null,null,null,null,{"$f":"IF($D15>$D17,$C16,IF($D17>$D15,$C18,IF(RIGHT($D15,1)=\"*\",$C16,IF(RIGHT($D17,1)=\"*\",$C18,\"\"))))","v":""},null,null,null,null,null,null,null,""]
[null,null,null,null,null,{"$f":"H58","v":44},{"$f":"IF($D21>$D23,$C21,IF($D23>$D21,$C23,IF(RIGHT($D21,1)=\"*\",$C21,IF(RIGHT($D23,1)=\"*\",$C23,\"\"))))","v":""},null,null,null,null,null,null,"Schb","Name","Erg."]
[null,{"$f":"D61","v":57},{"$f":"MC_Quali!C22","v":"CM_13"},null,null,null,{"$f":"IF($D21>$D23,$C22,IF($D23>$D21,$C24,IF(RIGHT($D21,1)=\"*\",$C22,IF(RIGHT($D23,1)=\"*\",$C24,\"\"))))","v":""},null,null,null,null,null,null,{"$f":"P55","v":21},{"$f":"IF($L12>$L14,$K12,IF($L14>$L12,$K14,IF(RIGHT($L12,1)=\"*\",$K12,IF(RIGHT($L14,1)=\"*\",$K14,\"\"))))","v":""}]
[13,null,{"$f":"MC_Quali!D22","v":"Schütze1_CM13  Schütze2_CM13 "},{"$f":"MC_Quali!G22","v":620},"Quali.",null,null,null,null,null,null,"Finale",null,null,{"$f":"IF($L12>$L14,$K13,IF($L14>$L12,$K15,IF(RIGHT($L12,1)=\"*\",$K13,IF(RIGHT($L14,1)=\"*\",$K15,\"\"))))","v":""}]
[4,{"$f":"D62","v":58},{"$f":"MC_Quali!C13","v":"CM_4"},null,null,null,null,null,null,null,null,"1. und 2. Platz",null,{"$f":"P56","v":22},{"$f":"IF($L36>$L38,$K36,IF($L38>$L36,$K38,IF(RIGHT($L36,1)=\"*\",$K36,IF(RIGHT($L38,1)=\"*\",$K38,\"\"))))","v":""}]
[null,null,{"$f":"MC_Quali!D13","v":"Schütze1_CM4 Schütze2_CM4"},{"$f":"MC_Quali!G13","v":629},"Quali.",null,null,null,null,null,null,null,null,null,{"$f":"IF($L36>$L38,$K37,IF($L38>$L36,$K39,IF(RIGHT($L36,1)=\"*\",$K37,IF(RIGHT($L38,1)=\"*\",$K39,\"\"))))","v":""}]
[]
[]
[null,{"$f":"D63","v":59},{"$f":"MC_Quali!C12","v":"CM_3"},null,null,null,null,null,null,null,null,null,null,{"$f":"P57","v":11},{"$f":"IF($L12<$L14,$K12,IF($L14<$L12,$K14,IF(RIGHT($L12,1)=\"*\",$K14,IF(RIGHT($L14,1)=\"*\",$K12,\"\"))))","v":""}]
[3,null,{"$f":"MC_Quali!D12","v":"Schütze1_CM3 Schütze2_CM3"},{"$f":"MC_Quali!G12","v":630},"Quali.",null,null,null,null,null,null,"Finale",null,null,{"$f":"IF($L12<$L14,$K13,IF($L14<$L12,$K15,IF(RIGHT($L12,1)=\"*\",$K12,IF(RIGHT($L14,1)=\"*\",$K14,\"\"))))","v":""}]
[14,{"$f":"D64","v":60},{"$f":"MC_Quali!C23","v":"CM_14"},null,null,null,null,null,null,null,null,"3. und 4. Platz",null,{"$f":"P58","v":12},{"$f":"IF($L36<$L38,$K36,IF($L38<$L36,$K38,IF(RIGHT($L36,1)=\"*\",$K38,IF(RIGHT($L38,1)=\"*\",$K36,\"\"))))","v":""}]
[null,null,{"$f":"MC_Quali!D23","v":"Schütze1_CM14 Schütze2_CM14 "},{"$f":"MC_Quali!G23","v":619},"Quali.",{"$f":"H59","v":45},{"$f":"IF($D27>$D29,$C27,IF($D29>$D27,$C29,IF(RIGHT($D27,1)=\"*\",$C27,IF(RIGHT($D29,1)=\"*\",$C29,\"\"))))","v":""},null,null,null,null,null,null,null,{"$f":"IF($L36<$L38,$K37,IF($L38<$L36,$K39,IF(RIGHT($L36,1)=\"*\",$K39,IF(RIGHT($L38,1)=\"*\",$K37,\"\"))))","v":""}]
[null,null,null,null,null,null,{"$f":"IF($D27>$D29,$C28,IF($D29>$D27,$C30,IF(RIGHT($D27,1)=\"*\",$C28,IF(RIGHT($D29,1)=\"*\",$C30,\"\"))))","v":""}]
[null,null,null,null,null,{"$f":"H60","v":46},{"$f":"IF($D33>$D35,$C33,IF($D35>$D33,$C35,IF(RIGHT($D33,1)=\"*\",$C33,IF(RIGHT($D35,1)=\"*\",$C35,\"\"))))","v":""}]
[null,{"$f":"D65","v":61},{"$f":"MC_Quali!C20","v":"CM_11"},null,null,null,{"$f":"IF($D33>$D35,$C34,IF($D35>$D33,$C36,IF(RIGHT($D33,1)=\"*\",$C34,IF(RIGHT($D35,1)=\"*\",$C36,\"\"))))","v":""}]
[11,null,{"$f":"MC_Quali!D20","v":"Schütze1_CM11 Schütze2_CM11"},{"$f":"MC_Quali!G20","v":622},"Quali."]
[6,{"$f":"D66","v":62},{"$f":"MC_Quali!C15","v":"CM_6"}]
[null,null,{"$f":"MC_Quali!D15","v":"Schütze1_CM6 Schütze2_CM6"},{"$f":"MC_Quali!G15","v":627},"Quali.",null,null,null,null,{"$f":"L57","v":33},{"$f":"IF($H30>$H32,$G30,IF($H32>$H30,$G32,IF(RIGHT($H30,1)=\"*\",$G30,IF(RIGHT($H32,1)=\"*\",$G32,\"\"))))","v":""}]
[null,null,null,null,null,null,null,null,null,null,{"$f":"IF($H30>$H32,$G31,IF($H32>$H30,$G33,IF(RIGHT($H30,1)=\"*\",$G31,IF(RIGHT($H32,1)=\"*\",$G33,\"\"))))","v":""}]
[null,null,null,null,null,null,null,null,null,{"$f":"L58","v":34},{"$f":"IF($H42>$H44,$G42,IF($H44>$H42,$G44,IF(RIGHT($H42,1)=\"*\",$G42,IF(RIGHT($H44,1)=\"*\",$G44,\"\"))))","v":""}]
[null,{"$f":"D67","v":63},{"$f":"MC_Quali!C16","v":"CM_7"},null,null,null,null,null,null,null,{"$f":"IF($H42>$H44,$G43,IF($H44>$H42,$G45,IF(RIGHT($H42,1)=\"*\",$G43,IF(RIGHT($H44,1)=\"*\",$G45,\"\"))))","v":""},null,null,null,"Finale"]
[7,null,{"$f":"MC_Quali!D16","v":"Schütze1_CM7 Schütze2_CM7"},{"$f":"MC_Quali!G16","v":626},"Quali."]
[10,{"$f":"D68","v":64},{"$f":"MC_Quali!C19","v":"CM_10"}]
[null,null,{"$f":"MC_Quali!D19","v":"Schütze1_CM10 Schütze2_CM10"},{"$f":"MC_Quali!G19","v":623},"Quali.",{"$f":"H61","v":47},{"$f":"IF($D39>$D41,$C39,IF($D41>$D39,$C41,IF(RIGHT($D39,1)=\"*\",$C39,IF(RIGHT($D41,1)=\"*\",$C41,\"\"))))","v":""},null,null,null,"1/2 Finale"]
[null,null,null,null,null,null,{"$f":"IF($D39>$D41,$C40,IF($D41>$D39,$C42,IF(RIGHT($D39,1)=\"*\",$C40,IF(RIGHT($D41,1)=\"*\",$C42,\"\"))))","v":""}]
[null,null,null,null,null,{"$f":"H62","v":48},{"$f":"IF($D45>$D47,$C45,IF($D47>$D45,$C47,IF(RIGHT($D45,1)=\"*\",$C45,IF(RIGHT($D47,1)=\"*\",$C47,\"\"))))","v":""}]
[null,{"$f":"D69","v":65},{"$f":"MC_Quali!C24","v":"CM_15"},null,null,null,{"$f":"IF($D45>$D47,$C46,IF($D47>$D45,$C48,IF(RIGHT($D45,1)=\"*\",$C46,IF(RIGHT($D47,1)=\"*\",$C48,\"\"))))","v":""}]
[15,null,{"$f":"MC_Quali!D24","v":"Schütze1_CM15 Schütze2_CM15"},{"$f":"MC_Quali!G24","v":618},"Quali.",null,null,null,null,null,null,{"$f":"CONCATENATE(Select!C14,\" \",Select!C20)","v":"Mannschaftsbewerb Compound Damen"}]
[2,{"$f":"D70","v":66},{"$f":"MC_Quali!C11","v":"CM_2"}]
[null,null,{"$f":"MC_Quali!D11","v":"Schütze1_CM2 Schütze2_CM2"},{"$f":"MC_Quali!G11","v":631},"Quali.",null,"1/4 Finale"]
[null,null,null,null,null,null,null,null,null,null,null,null,null,"*","= Im Stechen gewonnen"]
[null,null,"1/8 Elimination"]
[]
[]
[]
[null,null,"Scheibe:",null,null,null,"Scheibe:"]
[null,1,{"$f":"CONCATENATE($G$54,\" \",D55)","v":"Scheibe: 51"},51,null,1,{"$f":"CONCATENATE($G$54,\" \",H55)","v":"Scheibe: 41"},41,null,1,{"$f":"CONCATENATE($G$54,\" \",L55)","v":"Scheibe: 31"},31,null,1,{"$f":"CONCATENATE($G$54,\" \",P55)","v":"Scheibe: 21"},21]
[null,null,"Scheibe: 52",{"$f":"IF(RIGHT(D55,1)=\"A\",CONCATENATE(LEFT(D55,LEN(D55)-1),\"B\"),D55+1)","v":52},null,null,"Scheibe: 42",{"$f":"IF(RIGHT(H55,1)=\"A\",CONCATENATE(LEFT(H55,LEN(H55)-1),\"B\"),H55+1)","v":42},null,null,{"$f":"CONCATENATE($G$54,\" \",L56)","v":"Scheibe: 32"},{"$f":"IF(RIGHT(L55,1)=\"A\",CONCATENATE(LEFT(L55,LEN(L55)-1),\"B\"),L55+1)","v":32},null,null,{"$f":"CONCATENATE($G$54,\" \",P56)","v":"Scheibe: 22"},{"$f":"IF(RIGHT(P55,1)=\"A\",CONCATENATE(LEFT(P55,LEN(P55)-1),\"B\"),P55+1)","v":22}]
[null,{"$f":"B55+1","v":2},"Scheibe: 53",{"$f":"IF(RIGHT(D56,1)=\"B\",CONCATENATE(LEFT(D56,LEN(D56)-1)+1,\"A\"),D56+1)","v":53},null,{"$f":"F55+1","v":2},"Scheibe: 43",{"$f":"IF(RIGHT(H56,1)=\"B\",CONCATENATE(LEFT(H56,LEN(H56)-1)+1,\"A\"),H56+1)","v":43},null,{"$f":"J55+1","v":2},{"$f":"CONCATENATE($G$54,\" \",L57)","v":"Scheibe: 33"},{"$f":"IF(RIGHT(L56,1)=\"B\",CONCATENATE(LEFT(L56,LEN(L56)-1)+1,\"A\"),L56+1)","v":33},null,{"$f":"N55+1","v":2},{"$f":"CONCATENATE($G$54,\" \",P57)","v":"Scheibe: 11"},11]
[null,null,"Scheibe: 54",{"$f":"IF(RIGHT(D57,1)=\"A\",CONCATENATE(LEFT(D57,LEN(D57)-1),\"B\"),D57+1)","v":54},null,null,"Scheibe: 44",{"$f":"IF(RIGHT(H57,1)=\"A\",CONCATENATE(LEFT(H57,LEN(H57)-1),\"B\"),H57+1)","v":44},null,null,{"$f":"CONCATENATE($G$54,\" \",L58)","v":"Scheibe: 34"},{"$f":"IF(RIGHT(L57,1)=\"A\",CONCATENATE(LEFT(L57,LEN(L57)-1),\"B\"),L57+1)","v":34},null,null,{"$f":"CONCATENATE($G$54,\" \",P58)","v":"Scheibe: 12"},{"$f":"IF(RIGHT(P57,1)=\"A\",CONCATENATE(LEFT(P57,LEN(P57)-1),\"B\"),P57+1)","v":12}]
[null,{"$f":"B57+1","v":3},"Scheibe: 55",{"$f":"IF(RIGHT(D58,1)=\"B\",CONCATENATE(LEFT(D58,LEN(D58)-1)+1,\"A\"),D58+1)","v":55},null,{"$f":"F57+1","v":3},"Scheibe: 45",{"$f":"IF(RIGHT(H58,1)=\"B\",CONCATENATE(LEFT(H58,LEN(H58)-1)+1,\"A\"),H58+1)","v":45}]
[null,null,"Scheibe: 56",{"$f":"IF(RIGHT(D59,1)=\"A\",CONCATENATE(LEFT(D59,LEN(D59)-1),\"B\"),D59+1)","v":56},null,null,"Scheibe: 46",{"$f":"IF(RIGHT(H59,1)=\"A\",CONCATENATE(LEFT(H59,LEN(H59)-1),\"B\"),H59+1)","v":46}]
[null,{"$f":"B59+1","v":4},"Scheibe: 57",{"$f":"IF(RIGHT(D60,1)=\"B\",CONCATENATE(LEFT(D60,LEN(D60)-1)+1,\"A\"),D60+1)","v":57},null,{"$f":"F59+1","v":4},"Scheibe: 47",{"$f":"IF(RIGHT(H60,1)=\"B\",CONCATENATE(LEFT(H60,LEN(H60)-1)+1,\"A\"),H60+1)","v":47}]
[null,null,"Scheibe: 58",{"$f":"IF(RIGHT(D61,1)=\"A\",CONCATENATE(LEFT(D61,LEN(D61)-1),\"B\"),D61+1)","v":58},null,null,"Scheibe: 48",{"$f":"IF(RIGHT(H61,1)=\"A\",CONCATENATE(LEFT(H61,LEN(H61)-1),\"B\"),H61+1)","v":48}]
[null,{"$f":"B61+1","v":5},"Scheibe: 59",{"$f":"IF(RIGHT(D62,1)=\"B\",CONCATENATE(LEFT(D62,LEN(D62)-1)+1,\"A\"),D62+1)","v":59}]
[null,null,"Scheibe: 60",{"$f":"IF(RIGHT(D63,1)=\"A\",CONCATENATE(LEFT(D63,LEN(D63)-1),\"B\"),D63+1)","v":60}]
[null,{"$f":"B63+1","v":6},"Scheibe: 61",{"$f":"IF(RIGHT(D64,1)=\"B\",CONCATENATE(LEFT(D64,LEN(D64)-1)+1,\"A\"),D64+1)","v":61}]
[null,null,"Scheibe: 62",{"$f":"IF(RIGHT(D65,1)=\"A\",CONCATENATE(LEFT(D65,LEN(D65)-1),\"B\"),D65+1)","v":62}]
[null,{"$f":"B65+1","v":7},"Scheibe: 63",{"$f":"IF(RIGHT(D66,1)=\"B\",CONCATENATE(LEFT(D66,LEN(D66)-1)+1,\"A\"),D66+1)","v":63}]
[null,null,"Scheibe: 64",{"$f":"IF(RIGHT(D67,1)=\"A\",CONCATENATE(LEFT(D67,LEN(D67)-1),\"B\"),D67+1)","v":64}]
[null,{"$f":"B67+1","v":8},"Scheibe: 65",{"$f":"IF(RIGHT(D68,1)=\"B\",CONCATENATE(LEFT(D68,LEN(D68)-1)+1,\"A\"),D68+1)","v":65}]
[null,null,"Scheibe: 66",{"$f":"IF(RIGHT(D69,1)=\"A\",CONCATENATE(LEFT(D69,LEN(D69)-1),\"B\"),D69+1)","v":66}]

{"sheet":"MC16","index":16,"n_rows":734,"n_cols":20,"rows_kept":734,"cut":false,"hidden":true,"merged":[[27,17,27,22],[5,15,5,21],[8,0,8,4],[8,5,8,10],[8,12,8,16],[8,17,8,22],[10,0,12,0],[10,12,12,12],[1,0,1,9],[1,15,1,21],[2,0,2,9],[3,0,3,9],[3,15,4,21],[4,0,4,9],[5,2,5,10],[29,0,31,0],[29,12,31,12],[32,0,34,0],[32,12,34,12],[35,0,37,0],[35,12,37,12],[13,0,15,0],[13,12,15,12],[27,0,27,4],[27,5,27,10],[27,12,27,16],[16,0,18,0],[16,12,18,12],[19,0,21,0],[19,12,21,12],[73,17,73,22],[51,15,51,21],[54,0,54,4],[54,5,54,10],[54,12,54,16],[54,17,54,22],[56,0,58,0],[56,12,58,12],[38,0,40,0],[38,12,40,12],[47,0,47,9],[47,15,47,21],[48,0,48,9],[49,0,49,9],[49,15,50,21],[50,0,50,9],[51,2,51,10],[75,0,77,0],[75,12,77,12],[78,0,80,0],[78,12,80,12],[81,0,83,0],[81,12,83,12],[59,0,61,0],[59,12,61,12],[73,0,73,4],[73,5,73,10],[73,12,73,16],[62,0,64,0],[62,12,64,12],[65,0,67,0],[65,12,67,12],[119,17,119,22],[97,15,97,21],[100,0,100,4],[100,5,100,10],[100,12,100,16],[100,17,100,22],[102,0,104,0],[102,12,104,12],[84,0,86,0],[84,12,86,12],[93,0,93,9],[93,15,93,21],[94,0,94,9],[95,0,95,9],[95,15,96,21],[96,0,96,9],[97,2,97,10],[121,0,123,0],[121,12,123,12],[124,0,126,0],[124,12,126,12],[127,0,129,0],[127,12,129,12],[105,0,107,0],[105,12,107,12],[119,0,119,4],[119,5,119,10],[119,12,119,16],[108,0,110,0],[108,12,110,12],[111,0,113,0],[111,12,113,12],[165,17,165,22],[143,15,143,21],[146,0,146,4],[146,5,146,10],[146,12,146,16],[146,17,146,22],[148,0,150,0],[148,12,150,12],[130,0,132,0],[130,12,132,12],[139,0,139,9],[139,15,139,21],[140,0,140,9],[141,0,141,9],[141,15,142,21],[142,0,142,9],[143,2,143,10],[167,0,169,0],[167,12,169,12],[170,0,172,0],[170,12,172,12],[173,0,175,0],[173,12,175,12],[151,0,153,0],[151,12,153,12],[165,0,165,4],[165,5,165,10],[165,12,165,16],[154,0,156,0],[154,12,156,12],[157,0,159,0],[157,12,159,12],[211,17,211,22],[189,15,189,21],[192,0,192,4],[192,5,192,10],[192,12,192,16],[192,17,192,22],[194,0,196,0],[194,12,196,12],[176,0,178,0],[176,12,178,12],[185,0,185,9],[185,15,185,21],[186,0,186,9],[187,0,187,9],[187,15,188,21],[188,0,188,9],[189,2,189,10],[213,0,215,0],[213,12,215,12],[216,0,218,0],[216,12,218,12],[219,0,221,0],[219,12,221,12],[197,0,199,0],[197,12,199,12],[211,0,211,4],[211,5,211,10],[211,12,211,16],[200,0,202,0],[200,12,202,12],[203,0,205,0],[203,12,205,12],[257,17,257,22],[235,15,235,21],[238,0,238,4],[238,5,238,10],[238,12,238,16],[238,17,238,22],[240,0,242,0],[240,12,242,12],[222,0,224,0],[222,12,224,12],[231,0,231,9],[231,15,231,21],[232,0,232,9],[233,0,233,9],[233,15,234,21],[234,0,234,9],[235,2,235,10],[259,0,261,0],[259,12,261,12],[262,0,264,0],[262,12,264,12],[265,0,267,0],[265,12,267,12],[243,0,245,0],[243,12,245,12],[257,0,257,4],[257,5,257,10],[257,12,257,16],[246,0,248,0],[246,12,248,12],[249,0,251,0],[249,12,251,12],[303,17,303,22],[281,15,281,21],[284,0,284,4],[284,5,284,10],[284,12,284,16],[284,17,284,22],[286,0,288,0],[286,12,288,12],[268,0,270,0],[268,12,270,12],[277,0,277,9],[277,15,277,21],[278,0,278,9],[279,0,279,9],[279,15,280,21],[280,0,280,9],[281,2,281,10],[305,0,307,0],[305,12,307,12],[308,0,310,0],[308,12,310,12],[311,0,313,0],[311,12,313,12],[289,0,291,0],[289,12,291,12],[303,0,303,4],[303,5,303,10],[303,12,303,16],[292,0,294,0],[292,12,294,12],[295,0,297,0],[295,12,297,12],[349,17,349,22],[327,15,327,21],[330,0,330,4],[330,5,330,10],[330,12,330,16],[330,17,330,22],[332,0,334,0],[332,12,334,12],[314,0,316,0],[314,12,316,12],[323,0,323,9],[323,15,323,21],[324,0,324,9],[325,0,325,9],[325,15,326,21],[326,0,326,9],[327,2,327,10],[351,0,353,0],[351,12,353,12],[354,0,356,0],[354,12,356,12],[357,0,359,0],[357,12,359,12],[335,0,337,0],[335,12,337,12],[349,0,349,4],[349,5,349,10],[349,12,349,16],[338,0,340,0],[338,12,340,12],[341,0,343,0],[341,12,343,12],[395,17,395,22],[373,15,373,21],[376,0,376,4],[376,5,376,10],[376,12,376,16],[376,17,376,22],[378,0,380,0],[378,12,380,12],[360,0,362,0],[360,12,362,12],[369,0,369,9],[369,15,369,21],[370,0,370,9],[371,0,371,9],[371,15,372,21],[372,0,372,9],[373,2,373,10],[397,0,399,0],[397,12,399,12],[400,0,402,0],[400,12,402,12],[403,0,405,0],[403,12,405,12],[381,0,383,0],[381,12,383,12],[395,0,395,4],[395,5,395,10],[395,12,395,16],[384,0,386,0],[384,12,386,12],[387,0,389,0],[387,12,389,12],[441,17,441,22],[419,15,419,21],[422,0,422,4],[422,5,422,10],[422,12,422,16],[422,17,422,22],[424,0,426,0],[424,12,426,12],[406,0,408,0],[406,12,408,12],[415,0,415,9],[415,15,415,21],[416,0,416,9],[417,0,417,9],[417,15,418,21],[418,0,418,9],[419,2,419,10],[443,0,445,0],[443,12,445,12],[446,0,448,0],[446,12,448,12],[449,0,451,0],[449,12,451,12],[427,0,429,0],[427,12,429,12],[441,0,441,4],[441,5,441,10],[441,12,441,16],[430,0,432,0],[430,12,432,12],[433,0,435,0],[433,12,435,12],[487,17,487,22],[465,15,465,21],[468,0,468,4],[468,5,468,10],[468,12,468,16],[468,17,468,22],[470,0,472,0],[470,12,472,12],[452,0,454,0],[452,12,454,12],[461,0,461,9],[461,15,461,21],[462,0,462,9],[463,0,463,9],[463,15,464,21],[464,0,464,9],[465,2,465,10],[489,0,491,0],[489,12,491,12],[492,0,494,0],[492,12,494,12],[495,0,497,0],[495,12,497,12],[473,0,475,0],[473,12,475,12],[487,0,487,4],[487,5,487,10],[487,12,487,16],[476,0,478,0],[476,12,478,12],[479,0,481,0],[479,12,481,12],[533,17,533,22],[511,15,511,21],[514,0,514,4],[514,5,514,10],[514,12,514,16],[514,17,514,22],[516,0,518,0],[516,12,518,12],[498,0,500,0],[498,12,500,12],[507,0,507,9],[507,15,507,21],[508,0,508,9],[509,0,509,9],[509,15,510,21],[510,0,510,9],[511,2,511,10],[535,0,537,0],[535,12,537,12],[538,0,540,0],[538,12,540,12],[541,0,543,0],[541,12,543,12],[519,0,521,0],[519,12,521,12],[533,0,533,4],[533,5,533,10],[533,12,533,16],[522,0,524,0],[522,12,524,12],[525,0,527,0],[525,12,527,12],[579,17,579,22],[557,15,557,21],[560,0,560,4],[560,5,560,10],[560,12,560,16],[560,17,560,22],[562,0,564,0],[562,12,564,12],[544,0,546,0],[544,12,546,12],[553,0,553,9],[553,15,553,21],[554,0,554,9],[555,0,555,9],[555,15,556,21],[556,0,556,9],[557,2,557,10],[581,0,583,0],[581,12,583,12],[584,0,586,0],[584,12,586,12],[587,0,589,0],[587,12,589,12],[565,0,567,0],[565,12,567,12],[579,0,579,4],[579,5,579,10],[579,12,579,16],[568,0,570,0],[568,12,570,12],[571,0,573,0],[571,12,573,12],[625,17,625,22],[603,15,603,21],[606,0,606,4],[606,5,606,10],[606,12,606,16],[606,17,606,22],[608,0,610,0],[608,12,610,12],[590,0,592,0],[590,12,592,12],[599,0,599,9],[599,15,599,21],[600,0,600,9],[601,0,601,9],[601,15,602,21],[602,0,602,9],[603,2,603,10],[627,0,629,0],[627,12,629,12],[630,0,632,0],[630,12,632,12],[633,0,635,0],[633,12,635,12],[611,0,613,0],[611,12,613,12],[625,0,625,4],[625,5,625,10],[625,12,625,16],[614,0,616,0],[614,12,616,12],[617,0,619,0],[617,12,619,12],[671,17,671,22],[649,15,649,21],[652,0,652,4],[652,5,652,10],[652,12,652,16],[652,17,652,22],[654,0,656,0],[654,12,656,12],[636,0,638,0],[636,12,638,12],[645,0,645,9],[645,15,645,21],[646,0,646,9],[647,0,647,9],[647,15,648,21],[648,0,648,9],[649,2,649,10],[673,0,675,0],[673,12,675,12],[676,0,678,0],[676,12,678,12],[679,0,681,0],[679,12,681,12],[657,0,659,0],[657,12,659,12],[671,0,671,4],[671,5,671,10],[671,12,671,16],[660,0,662,0],[660,12,662,12],[663,0,665,0],[663,12,665,12],[717,17,717,22],[695,15,695,21],[698,0,698,4],[698,5,698,10],[698,12,698,16],[698,17,698,22],[700,0,702,0],[700,12,702,12],[682,0,684,0],[682,12,684,12],[691,0,691,9],[691,15,691,21],[692,0,692,9],[693,0,693,9],[693,15,694,21],[694,0,694,9],[695,2,695,10],[728,0,730,0],[728,12,730,12],[719,0,721,0],[719,12,721,12],[722,0,724,0],[722,12,724,12],[725,0,727,0],[725,12,727,12],[703,0,705,0],[703,12,705,12],[717,0,717,4],[717,5,717,10],[717,12,717,16],[706,0,708,0],[706,12,708,12],[709,0,711,0],[709,12,711,12]]}
[]
[{"$f":"Select!$C$12","v":"ÖM Indoor 2019"},null,null,null,null,null,null,null,null,null,null,null,"Mannschaft:",null,null,{"$f":"MC16_Baum!$C$3","v":"CM_1"}]
["Veranstaltung"]
[{"$f":"Select!$C$13","v":"09.-10. Februar 2019"},null,null,null,null,null,null,null,null,null,null,null,"Schützen:",null,null,{"$f":"MC16_Baum!$C$4","v":"Schütze1_CM1 Schütze2_CM1"}]
["Datum"]
["Bewerb:",null,{"$f":"Select!$C$14","v":"Mannschaftsbewerb"},null,null,null,null,null,null,null,null,null,"Bogenklasse:",null,null,{"$f":"Select!$C$20","v":"Compound Damen"}]
[]
[]
["1/8 Elimination",null,null,null,null,{"$f":"MC16_Baum!$C$55","v":"Scheibe: 51"},null,null,null,null,null,null,"1/4 Finale",null,null,null,null,{"$f":"MC16_Baum!$G$55","v":"Scheibe: 41"}]
[null,1,2,"Summe","Gesamt",null,null,null,null,null,null,null,null,1,2,"Summe","Gesamt"]
[1,null,null,null,null,null,null,null,null,null,null,null,1]
[]
[]
[2,null,null,null,null,null,null,null,null,null,null,null,2]
[]
[null,null,null,null,null,null,"Stechen (wenn erf.)",null,null,null,null,null,null,null,null,null,null,null,"Stechen (wenn erf.)"]
[3,null,null,null,null,null,1,null,null,null,null,null,3,null,null,null,null,null,1]
[null,null,null,null,null,null,2,null,null,null,null,null,null,null,null,null,null,null,2]
[null,null,null,null,null,null,3,null,null,null,null,null,null,null,null,null,null,null,3]
[4,null,null,null,null,null,null,null,null,null,null,null,4]
[]
[null,null,null,null,null,null,null,"gewonnen",null,null,null,null,null,null,null,null,null,null,null,"gewonnen"]
[null,null,null,null,null,null,null,"verloren",null,null,null,null,null,null,null,null,null,null,null,"verloren"]
[]
[null,"Schreiber:",null,null,null,null,"Kontrolle:",null,null,null,null,null,null,"Schreiber:",null,null,null,null,"Kontrolle:"]
[]
[]
["1/2 Finale",null,null,null,null,{"$f":"MC16_Baum!$K$55","v":"Scheibe: 31"},null,null,null,null,null,null,"1./2. od. 3./4. Platz",null,null,null,null,"Scheibe:"]
[null,1,2,"Summe","Gesamt",null,null,null,null,null,null,null,null,1,2,"Summe","Gesamt"]
[1,null,null,null,null,null,null,null,null,null,null,null,1]
[]
[]
[2,null,null,null,null,null,null,null,null,null,null,null,2]
[]
[null,null,null,null,null,null,"Stechen (wenn erf.)",null,null,null,null,null,null,null,null,null,null,null,"Stechen (wenn erf.)"]
[3,null,null,null,null,null,1,null,null,null,null,null,3,null,null,null,null,null,1]
[null,null,null,null,null,null,2,null,null,null,null,null,null,null,null,null,null,null,2]
[null,null,null,null,null,null,3,null,null,null,null,null,null,null,null,null,null,null,3]
[4,null,null,null,null,null,null,null,null,null,null,null,4]
[]
[null,null,null,null,null,null,null,"gewonnen",null,null,null,null,null,null,null,null,null,null,null,"gewonnen"]
[null,null,null,null,null,null,null,"verloren",null,null,null,null,null,null,null,null,null,null,null,"verloren"]
[]
[null,"Schreiber:",null,null,null,null,"Kontrolle:",null,null,null,null,null,null,"Schreiber:",null,null,null,null,"Kontrolle:"]
[]
[]
[]
[{"$f":"Select!$C$12","v":"ÖM Indoor 2019"},null,null,null,null,null,null,null,null,null,null,null,"Mannschaft:",null,null,{"$f":"MC16_Baum!$C$5","v":"CM_16"}]
["Veranstaltung"]
[{"$f":"Select!$C$13","v":"09.-10. Februar 2019"},null,null,null,null,null,null,null,null,null,null,null,"Schützen:",null,null,{"$f":"MC16_Baum!$C$6","v":"Schütze1_CM16  Schütze2_CM16"}]
["Datum"]
["Bewerb:",null,{"$f":"Select!$C$14","v":"Mannschaftsbewerb"},null,null,null,null,null,null,null,null,null,"Bogenklasse:",null,null,{"$f":"Select!$C$20","v":"Compound Damen"}]
[]
[]
["1/8 Elimination",null,null,null,null,{"$f":"MC16_Baum!$C$56","v":"Scheibe: 52"},null,null,null,null,null,null,"1/4 Finale",null,null,null,null,{"$f":"MC16_Baum!$G$55","v":"Scheibe: 41"}]
[null,1,2,"Summe","Gesamt",null,null,null,null,null,null,null,null,1,2,"Summe","Gesamt"]
[1,null,null,null,null,null,null,null,null,null,null,null,1]
[]
[]
[2,null,null,null,null,null,null,null,null,null,null,null,2]
[]
[null,null,null,null,null,null,"Stechen (wenn erf.)",null,null,null,null,null,null,null,null,null,null,null,"Stechen (wenn erf.)"]
[3,null,null,null,null,null,1,null,null,null,null,null,3,null,null,null,null,null,1]
[null,null,null,null,null,null,2,null,null,null,null,null,null,null,null,null,null,null,2]
[null,null,null,null,null,null,3,null,null,null,null,null,null,null,null,null,null,null,3]
[4,null,null,null,null,null,null,null,null,null,null,null,4]
[]
[null,null,null,null,null,null,null,"gewonnen",null,null,null,null,null,null,null,null,null,null,null,"gewonnen"]
[null,null,null,null,null,null,null,"verloren",null,null,null,null,null,null,null,null,null,null,null,"verloren"]
[]
[null,"Schreiber:",null,null,null,null,"Kontrolle:",null,null,null,null,null,null,"Schreiber:",null,null,null,null,"Kontrolle:"]
[]
[]
["1/2 Finale",null,null,null,null,{"$f":"MC16_Baum!$K$55","v":"Scheibe: 31"},null,null,null,null,null,null,"1./2. od. 3./4. Platz",null,null,null,null,"Scheibe:"]
[null,1,2,"Summe","Gesamt",null,null,null,null,null,null,null,null,1,2,"Summe","Gesamt"]
[1,null,null,null,null,null,null,null,null,null,null,null,1]
[]
[]
[2,null,null,null,null,null,null,null,null,null,null,null,2]
[]
[null,null,null,null,null,null,"Stechen (wenn erf.)",null,null,null,null,null,null,null,null,null,null,null,"Stechen (wenn erf.)"]
[3,null,null,null,null,null,1,null,null,null,null,null,3,null,null,null,null,null,1]
[null,null,null,null,null,null,2,null,null,null,null,null,null,null,null,null,null,null,2]
[null,null,null,null,null,null,3,null,null,null,null,null,null,null,null,null,null,null,3]
[4,null,null,null,null,null,null,null,null,null,null,null,4]
[]
[null,null,null,null,null,null,null,"gewonnen",null,null,null,null,null,null,null,null,null,null,null,"gewonnen"]
[null,null,null,null,null,null,null,"verloren",null,null,null,null,null,null,null,null,null,null,null,"verloren"]
[]
[null,"Schreiber:",null,null,null,null,"Kontrolle:",null,null,null,null,null,null,"Schreiber:",null,null,null,null,"Kontrolle:"]
[]
[]
[]
[{"$f":"Select!$C$12","v":"ÖM Indoor 2019"},null,null,null,null,null,null,null,null,null,null,null,"Mannschaft:",null,null,{"$f":"MC16_Baum!$C$9","v":"CM_9"}]
["Veranstaltung"]
[{"$f":"Select!$C$13","v":"09.-10. Februar 2019"},null,null,null,null,null,null,null,null,null,null,null,"Schützen:",null,null,{"$f":"MC16_Baum!$C$10","v":"Schütze1_CM9 Schütze2_CM9"}]
["Datum"]
["Bewerb:",null,{"$f":"Select!$C$14","v":"Mannschaftsbewerb"},null,null,null,null,null,null,null,null,null,"Bogenklasse:",null,null,{"$f":"Select!$C$20","v":"Compound Damen"}]
[]
[]
["1/8 Elimination",null,null,null,null,{"$f":"MC16_Baum!$C$57","v":"Scheibe: 53"},null,null,null,null,null,null,"1/4 Finale",null,null,null,null,{"$f":"MC16_Baum!$G$56","v":"Scheibe: 42"}]
[null,1,2,"Summe","Gesamt",null,null,null,null,null,null,null,null,1,2,"Summe","Gesamt"]
[1,null,null,null,null,null,null,null,null,null,null,null,1]
[]
[]
[2,null,null,null,null,null,null,null,null,null,null,null,2]
[]
[null,null,null,null,null,null,"Stechen (wenn erf.)",null,null,null,null,null,null,null,null,null,null,null,"Stechen (wenn erf.)"]
[3,null,null,null,null,null,1,null,null,null,null,null,3,null,null,null,null,null,1]
[null,null,null,null,null,null,2,null,null,null,null,null,null,null,null,null,null,null,2]
[null,null,null,null,null,null,3,null,null,null,null,null,null,null,null,null,null,null,3]
[4,null,null,null,null,null,null,null,null,null,null,null,4]
[]
[null,null,null,null,null,null,null,"gewonnen",null,null,null,null,null,null,null,null,null,null,null,"gewonnen"]
[null,null,null,null,null,null,null,"verloren",null,null,null,null,null,null,null,null,null,null,null,"verloren"]
[]
[null,"Schreiber:",null,null,null,null,"Kontrolle:",null,null,null,null,null,null,"Schreiber:",null,null,null,null,"Kontrolle:"]
[]
[]
["1/2 Finale",null,null,null,null,{"$f":"MC16_Baum!$K$55","v":"Scheibe: 31"},null,null,null,null,null,null,"1./2. od. 3./4. Platz",null,null,null,null,"Scheibe:"]
[null,1,2,"Summe","Gesamt",null,null,null,null,null,null,null,null,1,2,"Summe","Gesamt"]
[1,null,null,null,null,null,null,null,null,null,null,null,1]
[]
[]
[2,null,null,null,null,null,null,null,null,null,null,null,2]
[]
[null,null,null,null,null,null,"Stechen (wenn erf.)",null,null,null,null,null,null,null,null,null,null,null,"Stechen (wenn erf.)"]
[3,null,null,null,null,null,1,null,null,null,null,null,3,null,null,null,null,null,1]
[null,null,null,null,null,null,2,null,null,null,null,null,null,null,null,null,null,null,2]
[null,null,null,null,null,null,3,null,null,null,null,null,null,null,null,null,null,null,3]
[4,null,null,null,null,null,null,null,null,null,null,null,4]
[]
[null,null,null,null,null,null,null,"gewonnen",null,null,null,null,null,null,null,null,null,null,null,"gewonnen"]
[null,null,null,null,null,null,null,"verloren",null,null,null,null,null,null,null,null,null,null,null,"verloren"]
[]
[null,"Schreiber:",null,null,null,null,"Kontrolle:",null,null,null,null,null,null,"Schreiber:",null,null,null,null,"Kontrolle:"]
[]
[]
[]
[{"$f":"Select!$C$12","v":"ÖM Indoor 2019"},null,null,null,null,null,null,null,null,null,null,null,"Mannschaft:",null,null,{"$f":"MC16_Baum!$C$11","v":"CM_8"}]
["Veranstaltung"]
[{"$f":"Select!$C$13","v":"09.-10. Februar 2019"},null,null,null,null,null,null,null,null,null,null,null,"Schützen:",null,null,{"$f":"MC16_Baum!$C$12","v":"Schütze1_CM8 Schütze2_CM8"}]
["Datum"]
["Bewerb:",null,{"$f":"Select!$C$14","v":"Mannschaftsbewerb"},null,null,null,null,null,null,null,null,null,"Bogenklasse:",null,null,{"$f":"Select!$C$20","v":"Compound Damen"}]
[]
[]
["1/8 Elimination",null,null,null,null,{"$f":"MC16_Baum!$C$58","v":"Scheibe: 54"},null,null,null,null,null,null,"1/4 Finale",null,null,null,null,{"$f":"MC16_Baum!$G$56","v":"Scheibe: 42"}]
[null,1,2,"Summe","Gesamt",null,null,null,null,null,null,null,null,1,2,"Summe","Gesamt"]
[1,null,null,null,null,null,null,null,null,null,null,null,1]
[]
[]
[2,null,null,null,null,null,null,null,null,null,null,null,2]
[]
[null,null,null,null,null,null,"Stechen (wenn erf.)",null,null,null,null,null,null,null,null,null,null,null,"Stechen (wenn erf.)"]
[3,null,null,null,null,null,1,null,null,null,null,null,3,null,null,null,null,null,1]
[null,null,null,null,null,null,2,null,null,null,null,null,null,null,null,null,null,null,2]
[null,null,null,null,null,null,3,null,null,null,null,null,null,null,null,null,null,null,3]
[4,null,null,null,null,null,null,null,null,null,null,null,4]
[]
[null,null,null,null,null,null,null,"gewonnen",null,null,null,null,null,null,null,null,null,null,null,"gewonnen"]
[null,null,null,null,null,null,null,"verloren",null,null,null,null,null,null,null,null,null,null,null,"verloren"]
[]
[null,"Schreiber:",null,null,null,null,"Kontrolle:",null,null,null,null,null,null,"Schreiber:",null,null,null,null,"Kontrolle:"]
[]
[]
["1/2 Finale",null,null,null,null,{"$f":"MC16_Baum!$K$55","v":"Scheibe: 31"},null,null,null,null,null,null,"1./2. od. 3./4. Platz",null,null,null,null,"Scheibe:"]
[null,1,2,"Summe","Gesamt",null,null,null,null,null,null,null,null,1,2,"Summe","Gesamt"]
[1,null,null,null,null,null,null,null,null,null,null,null,1]
[]
[]
[2,null,null,null,null,null,null,null,null,null,null,null,2]
[]
[null,null,null,null,null,null,"Stechen (wenn erf.)",null,null,null,null,null,null,null,null,null,null,null,"Stechen (wenn erf.)"]
[3,null,null,null,null,null,1,null,null,null,null,null,3,null,null,null,null,null,1]
[null,null,null,null,null,null,2,null,null,null,null,null,null,null,null,null,null,null,2]
[null,null,null,null,null,null,3,null,null,null,null,null,null,null,null,null,null,null,3]
[4,null,null,null,null,null,null,null,null,null,null,null,4]
[]
[null,null,null,null,null,null,null,"gewonnen",null,null,null,null,null,null,null,null,null,null,null,"gewonnen"]
[null,null,null,null,null,null,null,"verloren",null,null,null,null,null,null,null,null,null,null,null,"verloren"]
[]
[null,"Schreiber:",null,null,null,null,"Kontrolle:",null,null,null,null,null,null,"Schreiber:",null,null,null,null,"Kontrolle:"]
[]
[]
[]
[{"$f":"Select!$C$12","v":"ÖM Indoor 2019"},null,null,null,null,null,null,null,null,null,null,null,"Mannschaft:",null,null,{"$f":"MC16_Baum!$C$15","v":"CM_5"}]
["Veranstaltung"]
[{"$f":"Select!$C$13","v":"09.-10. Februar 2019"},null,null,null,null,null,null,null,null,null,null,null,"Schützen:",null,null,{"$f":"MC16_Baum!$C$16","v":"Schütze1_CM5 Schütze2_CM5"}]
["Datum"]
["Bewerb:",null,{"$f":"Select!$C$14","v":"Mannschaftsbewerb"},null,null,null,null,null,null,null,null,null,"Bogenklasse:",null,null,{"$f":"Select!$C$20","v":"Compound Damen"}]
[]
[]
["1/8 Elimination",null,null,null,null,{"$f":"MC16_Baum!$C$59","v":"Scheibe: 55"},null,null,null,null,null,null,"1/4 Finale",null,null,null,null,{"$f":"MC16_Baum!$G$57","v":"Scheibe: 43"}]
[null,1,2,"Summe","Gesamt",null,null,null,null,null,null,null,null,1,2,"Summe","Gesamt"]
[1,null,null,null,null,null,null,null,null,null,null,null,1]
[]
[]
[2,null,null,null,null,null,null,null,null,null,null,null,2]
[]
[null,null,null,null,null,null,"Stechen (wenn erf.)",null,null,null,null,null,null,null,null,null,null,null,"Stechen (wenn erf.)"]
[3,null,null,null,null,null,1,null,null,null,null,null,3,null,null,null,null,null,1]
[null,null,null,null,null,null,2,null,null,null,null,null,null,null,null,null,null,null,2]
[null,null,null,null,null,null,3,null,null,null,null,null,null,null,null,null,null,null,3]
[4,null,null,null,null,null,null,null,null,null,null,null,4]
[]
[null,null,null,null,null,null,null,"gewonnen",null,null,null,null,null,null,null,null,null,null,null,"gewonnen"]
[null,null,null,null,null,null,null,"verloren",null,null,null,null,null,null,null,null,null,null,null,"verloren"]
[]
[null,"Schreiber:",null,null,null,null,"Kontrolle:",null,null,null,null,null,null,"Schreiber:",null,null,null,null,"Kontrolle:"]
[]
[]
["1/2 Finale",null,null,null,null,{"$f":"MC16_Baum!$K$56","v":"Scheibe: 32"},null,null,null,null,null,null,"1./2. od. 3./4. Platz",null,null,null,null,"Scheibe:"]
[null,1,2,"Summe","Gesamt",null,null,null,null,null,null,null,null,1,2,"Summe","Gesamt"]
[1,null,null,null,null,null,null,null,null,null,null,null,1]
[]
[]
[2,null,null,null,null,null,null,null,null,null,null,null,2]
[]
[null,null,null,null,null,null,"Stechen (wenn erf.)",null,null,null,null,null,null,null,null,null,null,null,"Stechen (wenn erf.)"]
[3,null,null,null,null,null,1,null,null,null,null,null,3,null,null,null,null,null,1]
[null,null,null,null,null,null,2,null,null,null,null,null,null,null,null,null,null,null,2]
[null,null,null,null,null,null,3,null,null,null,null,null,null,null,null,null,null,null,3]
[4,null,null,null,null,null,null,null,null,null,null,null,4]
[]
[null,null,null,null,null,null,null,"gewonnen",null,null,null,null,null,null,null,null,null,null,null,"gewonnen"]
[null,null,null,null,null,null,null,"verloren",null,null,null,null,null,null,null,null,null,null,null,"verloren"]
[]
[null,"Schreiber:",null,null,null,null,"Kontrolle:",null,null,null,null,null,null,"Schreiber:",null,null,null,null,"Kontrolle:"]
[]
[]
[]
[{"$f":"Select!$C$12","v":"ÖM Indoor 2019"},null,null,null,null,null,null,null,null,null,null,null,"Mannschaft:",null,null,{"$f":"MC16_Baum!$C$17","v":"CM_12"}]
["Veranstaltung"]
[{"$f":"Select!$C$13","v":"09.-10. Februar 2019"},null,null,null,null,null,null,null,null,null,null,null,"Schützen:",null,null,{"$f":"MC16_Baum!$C$18","v":"Schütze1_CM12  Schütze2_CM12"}]
["Datum"]
["Bewerb:",null,{"$f":"Select!$C$14","v":"Mannschaftsbewerb"},null,null,null,null,null,null,null,null,null,"Bogenklasse:",null,null,{"$f":"Select!$C$20","v":"Compound Damen"}]
[]
[]
["1/8 Elimination",null,null,null,null,{"$f":"MC16_Baum!$C$60","v":"Scheibe: 56"},null,null,null,null,null,null,"1/4 Finale",null,null,null,null,{"$f":"MC16_Baum!$G$57","v":"Scheibe: 43"}]
[null,1,2,"Summe","Gesamt",null,null,null,null,null,null,null,null,1,2,"Summe","Gesamt"]
[1,null,null,null,null,null,null,null,null,null,null,null,1]
[]
[]
[2,null,null,null,null,null,null,null,null,null,null,null,2]
[]
[null,null,null,null,null,null,"Stechen (wenn erf.)",null,null,null,null,null,null,null,null,null,null,null,"Stechen (wenn erf.)"]
[3,null,null,null,null,null,1,null,null,null,null,null,3,null,null,null,null,null,1]
[null,null,null,null,null,null,2,null,null,null,null,null,null,null,null,null,null,null,2]
[null,null,null,null,null,null,3,null,null,null,null,null,null,null,null,null,null,null,3]
[4,null,null,null,null,null,null,null,null,null,null,null,4]
[]
[null,null,null,null,null,null,null,"gewonnen",null,null,null,null,null,null,null,null,null,null,null,"gewonnen"]
[null,null,null,null,null,null,null,"verloren",null,null,null,null,null,null,null,null,null,null,null,"verloren"]
[]
[null,"Schreiber:",null,null,null,null,"Kontrolle:",null,null,null,null,null,null,"Schreiber:",null,null,null,null,"Kontrolle:"]
[]
[]
["1/2 Finale",null,null,null,null,{"$f":"MC16_Baum!$K$56","v":"Scheibe: 32"},null,null,null,null,null,null,"1./2. od. 3./4. Platz",null,null,null,null,"Scheibe:"]
[null,1,2,"Summe","Gesamt",null,null,null,null,null,null,null,null,1,2,"Summe","Gesamt"]
[1,null,null,null,null,null,null,null,null,null,null,null,1]
[]
[]
[2,null,null,null,null,null,null,null,null,null,null,null,2]
[]
[null,null,null,null,null,null,"Stechen (wenn erf.)",null,null,null,null,null,null,null,null,null,null,null,"Stechen (wenn erf.)"]
[3,null,null,null,null,null,1,null,null,null,null,null,3,null,null,null,null,null,1]
[null,null,null,null,null,null,2,null,null,null,null,null,null,null,null,null,null,null,2]
[null,null,null,null,null,null,3,null,null,null,null,null,null,null,null,null,null,null,3]
[4,null,null,null,null,null,null,null,null,null,null,null,4]
[]
[null,null,null,null,null,null,null,"gewonnen",null,null,null,null,null,null,null,null,null,null,null,"gewonnen"]
[null,null,null,null,null,null,null,"verloren",null,null,null,null,null,null,null,null,null,null,null,"verloren"]
[]
[null,"Schreiber:",null,null,null,null,"Kontrolle:",null,null,null,null,null,null,"Schreiber:",null,null,null,null,"Kontrolle:"]
[]
[]
[]
[{"$f":"Select!$C$12","v":"ÖM Indoor 2019"},null,null,null,null,null,null,null,null,null,null,null,"Mannschaft:",null,null,{"$f":"MC16_Baum!$C$21","v":"CM_13"}]
["Veranstaltung"]
[{"$f":"Select!$C$13","v":"09.-10. Februar 2019"},null,null,null,null,null,null,null,null,null,null,null,"Schützen:",null,null,{"$f":"MC16_Baum!$C$22","v":"Schütze1_CM13  Schütze2_CM13 "}]
["Datum"]
["Bewerb:",null,{"$f":"Select!$C$14","v":"Mannschaftsbewerb"},null,null,null,null,null,null,null,null,null,"Bogenklasse:",null,null,{"$f":"Select!$C$20","v":"Compound Damen"}]
[]
[]
["1/8 Elimination",null,null,null,null,{"$f":"MC16_Baum!$C$61","v":"Scheibe: 57"},null,null,null,null,null,null,"1/4 Finale",null,null,null,null,{"$f":"MC16_Baum!$G$58","v":"Scheibe: 44"}]
[null,1,2,"Summe","Gesamt",null,null,null,null,null,null,null,null,1,2,"Summe","Gesamt"]
[1,null,null,null,null,null,null,null,null,null,null,null,1]
[]
[]
[2,null,null,null,null,null,null,null,null,null,null,null,2]
[]
[null,null,null,null,null,null,"Stechen (wenn erf.)",null,null,null,null,null,null,null,null,null,null,null,"Stechen (wenn erf.)"]
[3,null,null,null,null,null,1,null,null,null,null,null,3,null,null,null,null,null,1]
[null,null,null,null,null,null,2,null,null,null,null,null,null,null,null,null,null,null,2]
[null,null,null,null,null,null,3,null,null,null,null,null,null,null,null,null,null,null,3]
[4,null,null,null,null,null,null,null,null,null,null,null,4]
[]
[null,null,null,null,null,null,null,"gewonnen",null,null,null,null,null,null,null,null,null,null,null,"gewonnen"]
[null,null,null,null,null,null,null,"verloren",null,null,null,null,null,null,null,null,null,null,null,"verloren"]
[]
[null,"Schreiber:",null,null,null,null,"Kontrolle:",null,null,null,null,null,null,"Schreiber:",null,null,null,null,"Kontrolle:"]
[]
[]
["1/2 Finale",null,null,null,null,{"$f":"MC16_Baum!$K$56","v":"Scheibe: 32"},null,null,null,null,null,null,"1./2. od. 3./4. Platz",null,null,null,null,"Scheibe:"]
[null,1,2,"Summe","Gesamt",null,null,null,null,null,null,null,null,1,2,"Summe","Gesamt"]
[1,null,null,null,null,null,null,null,null,null,null,null,1]
[]
[]
[2,null,null,null,null,null,null,null,null,null,null,null,2]
[]
[null,null,null,null,null,null,"Stechen (wenn erf.)",null,null,null,null,null,null,null,null,null,null,null,"Stechen (wenn erf.)"]
[3,null,null,null,null,null,1,null,null,null,null,null,3,null,null,null,null,null,1]
[null,null,null,null,null,null,2,null,null,null,null,null,null,null,null,null,null,null,2]
[null,null,null,null,null,null,3,null,null,null,null,null,null,null,null,null,null,null,3]
[4,null,null,null,null,null,null,null,null,null,null,null,4]
[]
[null,null,null,null,null,null,null,"gewonnen",null,null,null,null,null,null,null,null,null,null,null,"gewonnen"]
[null,null,null,null,null,null,null,"verloren",null,null,null,null,null,null,null,null,null,null,null,"verloren"]
[]
[null,"Schreiber:",null,null,null,null,"Kontrolle:",null,null,null,null,null,null,"Schreiber:",null,null,null,null,"Kontrolle:"]
[]
[]
[]
[{"$f":"Select!$C$12","v":"ÖM Indoor 2019"},null,null,null,null,null,null,null,null,null,null,null,"Mannschaft:",null,null,{"$f":"MC16_Baum!$C$23","v":"CM_4"}]
["Veranstaltung"]
[{"$f":"Select!$C$13","v":"09.-10. Februar 2019"},null,null,null,null,null,null,null,null,null,null,null,"Schützen:",null,null,{"$f":"MC16_Baum!$C$24","v":"Schütze1_CM4 Schütze2_CM4"}]
["Datum"]
["Bewerb:",null,{"$f":"Select!$C$14","v":"Mannschaftsbewerb"},null,null,null,null,null,null,null,null,null,"Bogenklasse:",null,null,{"$f":"Select!$C$20","v":"Compound Damen"}]
[]
[]
["1/8 Elimination",null,null,null,null,{"$f":"MC16_Baum!$C$62","v":"Scheibe: 58"},null,null,null,null,null,null,"1/4 Finale",null,null,null,null,{"$f":"MC16_Baum!$G$58","v":"Scheibe: 44"}]
[null,1,2,"Summe","Gesamt",null,null,null,null,null,null,null,null,1,2,"Summe","Gesamt"]
[1,null,null,null,null,null,null,null,null,null,null,null,1]
[]
[]
[2,null,null,null,null,null,null,null,null,null,null,null,2]
[]
[null,null,null,null,null,null,"Stechen (wenn erf.)",null,null,null,null,null,null,null,null,null,null,null,"Stechen (wenn erf.)"]
[3,null,null,null,null,null,1,null,null,null,null,null,3,null,null,null,null,null,1]
[null,null,null,null,null,null,2,null,null,null,null,null,null,null,null,null,null,null,2]
[null,null,null,null,null,null,3,null,null,null,null,null,null,null,null,null,null,null,3]
[4,null,null,null,null,null,null,null,null,null,null,null,4]
[]
[null,null,null,null,null,null,null,"gewonnen",null,null,null,null,null,null,null,null,null,null,null,"gewonnen"]
[null,null,null,null,null,null,null,"verloren",null,null,null,null,null,null,null,null,null,null,null,"verloren"]
[]
[null,"Schreiber:",null,null,null,null,"Kontrolle:",null,null,null,null,null,null,"Schreiber:",null,null,null,null,"Kontrolle:"]
[]
[]
["1/2 Finale",null,null,null,null,{"$f":"MC16_Baum!$K$56","v":"Scheibe: 32"},null,null,null,null,null,null,"1./2. od. 3./4. Platz",null,null,null,null,"Scheibe:"]
[null,1,2,"Summe","Gesamt",null,null,null,null,null,null,null,null,1,2,"Summe","Gesamt"]
[1,null,null,null,null,null,null,null,null,null,null,null,1]
[]
[]
[2,null,null,null,null,null,null,null,null,null,null,null,2]
[]
[null,null,null,null,null,null,"Stechen (wenn erf.)",null,null,null,null,null,null,null,null,null,null,null,"Stechen (wenn erf.)"]
[3,null,null,null,null,null,1,null,null,null,null,null,3,null,null,null,null,null,1]
[null,null,null,null,null,null,2,null,null,null,null,null,null,null,null,null,null,null,2]
[null,null,null,null,null,null,3,null,null,null,null,null,null,null,null,null,null,null,3]
[4,null,null,null,null,null,null,null,null,null,null,null,4]
[]
[null,null,null,null,null,null,null,"gewonnen",null,null,null,null,null,null,null,null,null,null,null,"gewonnen"]
[null,null,null,null,null,null,null,"verloren",null,null,null,null,null,null,null,null,null,null,null,"verloren"]
[]
[null,"Schreiber:",null,null,null,null,"Kontrolle:",null,null,null,null,null,null,"Schreiber:",null,null,null,null,"Kontrolle:"]
[]
[]
[]
[{"$f":"Select!$C$12","v":"ÖM Indoor 2019"},null,null,null,null,null,null,null,null,null,null,null,"Mannschaft:",null,null,{"$f":"MC16_Baum!$C$27","v":"CM_3"}]
["Veranstaltung"]
[{"$f":"Select!$C$13","v":"09.-10. Februar 2019"},null,null,null,null,null,null,null,null,null,null,null,"Schützen:",null,null,{"$f":"MC16_Baum!$C$28","v":"Schütze1_CM3 Schütze2_CM3"}]
["Datum"]
["Bewerb:",null,{"$f":"Select!$C$14","v":"Mannschaftsbewerb"},null,null,null,null,null,null,null,null,null,"Bogenklasse:",null,null,{"$f":"Select!$C$20","v":"Compound Damen"}]
[]
[]
["1/8 Elimination",null,null,null,null,{"$f":"MC16_Baum!$C$63","v":"Scheibe: 59"},null,null,null,null,null,null,"1/4 Finale",null,null,null,null,{"$f":"MC16_Baum!$G$59","v":"Scheibe: 45"}]
[null,1,2,"Summe","Gesamt",null,null,null,null,null,null,null,null,1,2,"Summe","Gesamt"]
[1,null,null,null,null,null,null,null,null,null,null,null,1]
[]
[]
[2,null,null,null,null,null,null,null,null,null,null,null,2]
[]
[null,null,null,null,null,null,"Stechen (wenn erf.)",null,null,null,null,null,null,null,null,null,null,null,"Stechen (wenn erf.)"]
[3,null,null,null,null,null,1,null,null,null,null,null,3,null,null,null,null,null,1]
[null,null,null,null,null,null,2,null,null,null,null,null,null,null,null,null,null,null,2]
[null,null,null,null,null,null,3,null,null,null,null,null,null,null,null,null,null,null,3]
[4,null,null,null,null,null,null,null,null,null,null,null,4]
[]
[null,null,null,null,null,null,null,"gewonnen",null,null,null,null,null,null,null,null,null,null,null,"gewonnen"]
[null,null,null,null,null,null,null,"verloren",null,null,null,null,null,null,null,null,null,null,null,"verloren"]
[]
[null,"Schreiber:",null,null,null,null,"Kontrolle:",null,null,null,null,null,null,"Schreiber:",null,null,null,null,"Kontrolle:"]
[]
[]
["1/2 Finale",null,null,null,null,{"$f":"MC16_Baum!$K$57","v":"Scheibe: 33"},null,null,null,null,null,null,"1./2. od. 3./4. Platz",null,null,null,null,"Scheibe:"]
[null,1,2,"Summe","Gesamt",null,null,null,null,null,null,null,null,1,2,"Summe","Gesamt"]
[1,null,null,null,null,null,null,null,null,null,null,null,1]
[]
[]
[2,null,null,null,null,null,null,null,null,null,null,null,2]
[]
[null,null,null,null,null,null,"Stechen (wenn erf.)",null,null,null,null,null,null,null,null,null,null,null,"Stechen (wenn erf.)"]
[3,null,null,null,null,null,1,null,null,null,null,null,3,null,null,null,null,null,1]
[null,null,null,null,null,null,2,null,null,null,null,null,null,null,null,null,null,null,2]
[null,null,null,null,null,null,3,null,null,null,null,null,null,null,null,null,null,null,3]
[4,null,null,null,null,null,null,null,null,null,null,null,4]
[]
[null,null,null,null,null,null,null,"gewonnen",null,null,null,null,null,null,null,null,null,null,null,"gewonnen"]
[null,null,null,null,null,null,null,"verloren",null,null,null,null,null,null,null,null,null,null,null,"verloren"]
[]
[null,"Schreiber:",null,null,null,null,"Kontrolle:",null,null,null,null,null,null,"Schreiber:",null,null,null,null,"Kontrolle:"]
[]
[]
[]
[{"$f":"Select!$C$12","v":"ÖM Indoor 2019"},null,null,null,null,null,null,null,null,null,null,null,"Mannschaft:",null,null,{"$f":"MC16_Baum!$C$29","v":"CM_14"}]
["Veranstaltung"]
[{"$f":"Select!$C$13","v":"09.-10. Februar 2019"},null,null,null,null,null,null,null,null,null,null,null,"Schützen:",null,null,{"$f":"MC16_Baum!$C$30","v":"Schütze1_CM14 Schütze2_CM14 "}]
["Datum"]
["Bewerb:",null,{"$f":"Select!$C$14","v":"Mannschaftsbewerb"},null,null,null,null,null,null,null,null,null,"Bogenklasse:",null,null,{"$f":"Select!$C$20","v":"Compound Damen"}]
[]
[]
["1/8 Elimination",null,null,null,null,{"$f":"MC16_Baum!$C$64","v":"Scheibe: 60"},null,null,null,null,null,null,"1/4 Finale",null,null,null,null,{"$f":"MC16_Baum!$G$59","v":"Scheibe: 45"}]
[null,1,2,"Summe","Gesamt",null,null,null,null,null,null,null,null,1,2,"Summe","Gesamt"]
[1,null,null,null,null,null,null,null,null,null,null,null,1]
[]
[]
[2,null,null,null,null,null,null,null,null,null,null,null,2]
[]
[null,null,null,null,null,null,"Stechen (wenn erf.)",null,null,null,null,null,null,null,null,null,null,null,"Stechen (wenn erf.)"]
[3,null,null,null,null,null,1,null,null,null,null,null,3,null,null,null,null,null,1]
[null,null,null,null,null,null,2,null,null,null,null,null,null,null,null,null,null,null,2]
[null,null,null,null,null,null,3,null,null,null,null,null,null,null,null,null,null,null,3]
[4,null,null,null,null,null,null,null,null,null,null,null,4]
[]
[null,null,null,null,null,null,null,"gewonnen",null,null,null,null,null,null,null,null,null,null,null,"gewonnen"]
[null,null,null,null,null,null,null,"verloren",null,null,null,null,null,null,null,null,null,null,null,"verloren"]
[]
[null,"Schreiber:",null,null,null,null,"Kontrolle:",null,null,null,null,null,null,"Schreiber:",null,null,null,null,"Kontrolle:"]
[]
[]
["1/2 Finale",null,null,null,null,{"$f":"MC16_Baum!$K$57","v":"Scheibe: 33"},null,null,null,null,null,null,"1./2. od. 3./4. Platz",null,null,null,null,"Scheibe:"]
[null,1,2,"Summe","Gesamt",null,null,null,null,null,null,null,null,1,2,"Summe","Gesamt"]
[1,null,null,null,null,null,null,null,null,null,null,null,1]
[]
[]
[2,null,null,null,null,null,null,null,null,null,null,null,2]
[]
[null,null,null,null,null,null,"Stechen (wenn erf.)",null,null,null,null,null,null,null,null,null,null,null,"Stechen (wenn erf.)"]
[3,null,null,null,null,null,1,null,null,null,null,null,3,null,null,null,null,null,1]
[null,null,null,null,null,null,2,null,null,null,null,null,null,null,null,null,null,null,2]
[null,null,null,null,null,null,3,null,null,null,null,null,null,null,null,null,null,null,3]
[4,null,null,null,null,null,null,null,null,null,null,null,4]
[]
[null,null,null,null,null,null,null,"gewonnen",null,null,null,null,null,null,null,null,null,null,null,"gewonnen"]
[null,null,null,null,null,null,null,"verloren",null,null,null,null,null,null,null,null,null,null,null,"verloren"]
[]
[null,"Schreiber:",null,null,null,null,"Kontrolle:",null,null,null,null,null,null,"Schreiber:",null,null,null,null,"Kontrolle:"]
[]
[]
[]
[{"$f":"Select!$C$12","v":"ÖM Indoor 2019"},null,null,null,null,null,null,null,null,null,null,null,"Mannschaft:",null,null,{"$f":"MC16_Baum!$C$33","v":"CM_11"}]
["Veranstaltung"]
[{"$f":"Select!$C$13","v":"09.-10. Februar 2019"},null,null,null,null,null,null,null,null,null,null,null,"Schützen:",null,null,{"$f":"MC16_Baum!$C$34","v":"Schütze1_CM11 Schütze2_CM11"}]
["Datum"]
["Bewerb:",null,{"$f":"Select!$C$14","v":"Mannschaftsbewerb"},null,null,null,null,null,null,null,null,null,"Bogenklasse:",null,null,{"$f":"Select!$C$20","v":"Compound Damen"}]
[]
[]
["1/8 Elimination",null,null,null,null,{"$f":"MC16_Baum!$C$65","v":"Scheibe: 61"},null,null,null,null,null,null,"1/4 Finale",null,null,null,null,{"$f":"MC16_Baum!$G$60","v":"Scheibe: 46"}]
[null,1,2,"Summe","Gesamt",null,null,null,null,null,null,null,null,1,2,"Summe","Gesamt"]
[1,null,null,null,null,null,null,null,null,null,null,null,1]
[]
[]
[2,null,null,null,null,null,null,null,null,null,null,null,2]
[]
[null,null,null,null,null,null,"Stechen (wenn erf.)",null,null,null,null,null,null,null,null,null,null,null,"Stechen (wenn erf.)"]
[3,null,null,null,null,null,1,null,null,null,null,null,3,null,null,null,null,null,1]
[null,null,null,null,null,null,2,null,null,null,null,null,null,null,null,null,null,null,2]
[null,null,null,null,null,null,3,null,null,null,null,null,null,null,null,null,null,null,3]
[4,null,null,null,null,null,null,null,null,null,null,null,4]
[]
[null,null,null,null,null,null,null,"gewonnen",null,null,null,null,null,null,null,null,null,null,null,"gewonnen"]
[null,null,null,null,null,null,null,"verloren",null,null,null,null,null,null,null,null,null,null,null,"verloren"]
[]
[null,"Schreiber:",null,null,null,null,"Kontrolle:",null,null,null,null,null,null,"Schreiber:",null,null,null,null,"Kontrolle:"]
[]
[]
["1/2 Finale",null,null,null,null,{"$f":"MC16_Baum!$K$57","v":"Scheibe: 33"},null,null,null,null,null,null,"1./2. od. 3./4. Platz",null,null,null,null,"Scheibe:"]
[null,1,2,"Summe","Gesamt",null,null,null,null,null,null,null,null,1,2,"Summe","Gesamt"]
[1,null,null,null,null,null,null,null,null,null,null,null,1]
[]
[]
[2,null,null,null,null,null,null,null,null,null,null,null,2]
[]
[null,null,null,null,null,null,"Stechen (wenn erf.)",null,null,null,null,null,null,null,null,null,null,null,"Stechen (wenn erf.)"]
[3,null,null,null,null,null,1,null,null,null,null,null,3,null,null,null,null,null,1]
[null,null,null,null,null,null,2,null,null,null,null,null,null,null,null,null,null,null,2]
[null,null,null,null,null,null,3,null,null,null,null,null,null,null,null,null,null,null,3]
[4,null,null,null,null,null,null,null,null,null,null,null,4]
[]
[null,null,null,null,null,null,null,"gewonnen",null,null,null,null,null,null,null,null,null,null,null,"gewonnen"]
[null,null,null,null,null,null,null,"verloren",null,null,null,null,null,null,null,null,null,null,null,"verloren"]
[]
[null,"Schreiber:",null,null,null,null,"Kontrolle:",null,null,null,null,null,null,"Schreiber:",null,null,null,null,"Kontrolle:"]
[]
[]
[]
[{"$f":"Select!$C$12","v":"ÖM Indoor 2019"},null,null,null,null,null,null,null,null,null,null,null,"Mannschaft:",null,null,{"$f":"MC16_Baum!$C$35","v":"CM_6"}]
["Veranstaltung"]
[{"$f":"Select!$C$13","v":"09.-10. Februar 2019"},null,null,null,null,null,null,null,null,null,null,null,"Schützen:",null,null,{"$f":"MC16_Baum!$C$36","v":"Schütze1_CM6 Schütze2_CM6"}]
["Datum"]
["Bewerb:",null,{"$f":"Select!$C$14","v":"Mannschaftsbewerb"},null,null,null,null,null,null,null,null,null,"Bogenklasse:",null,null,{"$f":"Select!$C$20","v":"Compound Damen"}]
[]
[]
["1/8 Elimination",null,null,null,null,{"$f":"MC16_Baum!$C$66","v":"Scheibe: 62"},null,null,null,null,null,null,"1/4 Finale",null,null,null,null,{"$f":"MC16_Baum!$G$60","v":"Scheibe: 46"}]
[null,1,2,"Summe","Gesamt",null,null,null,null,null,null,null,null,1,2,"Summe","Gesamt"]
[1,null,null,null,null,null,null,null,null,null,null,null,1]
[]
[]
[2,null,null,null,null,null,null,null,null,null,null,null,2]
[]
[null,null,null,null,null,null,"Stechen (wenn erf.)",null,null,null,null,null,null,null,null,null,null,null,"Stechen (wenn erf.)"]
[3,null,null,null,null,null,1,null,null,null,null,null,3,null,null,null,null,null,1]
[null,null,null,null,null,null,2,null,null,null,null,null,null,null,null,null,null,null,2]
[null,null,null,null,null,null,3,null,null,null,null,null,null,null,null,null,null,null,3]
[4,null,null,null,null,null,null,null,null,null,null,null,4]
[]
[null,null,null,null,null,null,null,"gewonnen",null,null,null,null,null,null,null,null,null,null,null,"gewonnen"]
[null,null,null,null,null,null,null,"verloren",null,null,null,null,null,null,null,null,null,null,null,"verloren"]
[]
[null,"Schreiber:",null,null,null,null,"Kontrolle:",null,null,null,null,null,null,"Schreiber:",null,null,null,null,"Kontrolle:"]
[]
[]
["1/2 Finale",null,null,null,null,{"$f":"MC16_Baum!$K$57","v":"Scheibe: 33"},null,null,null,null,null,null,"1./2. od. 3./4. Platz",null,null,null,null,"Scheibe:"]
[null,1,2,"Summe","Gesamt",null,null,null,null,null,null,null,null,1,2,"Summe","Gesamt"]
[1,null,null,null,null,null,null,null,null,null,null,null,1]
[]
[]
[2,null,null,null,null,null,null,null,null,null,null,null,2]
[]
[null,null,null,null,null,null,"Stechen (wenn erf.)",null,null,null,null,null,null,null,null,null,null,null,"Stechen (wenn erf.)"]
[3,null,null,null,null,null,1,null,null,null,null,null,3,null,null,null,null,null,1]
[null,null,null,null,null,null,2,null,null,null,null,null,null,null,null,null,null,null,2]
[null,null,null,null,null,null,3,null,null,null,null,null,null,null,null,null,null,null,3]
[4,null,null,null,null,null,null,null,null,null,null,null,4]
[]
[null,null,null,null,null,null,null,"gewonnen",null,null,null,null,null,null,null,null,null,null,null,"gewonnen"]
[null,null,null,null,null,null,null,"verloren",null,null,null,null,null,null,null,null,null,null,null,"verloren"]
[]
[null,"Schreiber:",null,null,null,null,"Kontrolle:",null,null,null,null,null,null,"Schreiber:",null,null,null,null,"Kontrolle:"]
[]
[]
[]
[{"$f":"Select!$C$12","v":"ÖM Indoor 2019"},null,null,null,null,null,null,null,null,null,null,null,"Mannschaft:",null,null,{"$f":"MC16_Baum!$C$39","v":"CM_7"}]
["Veranstaltung"]
[{"$f":"Select!$C$13","v":"09.-10. Februar 2019"},null,null,null,null,null,null,null,null,null,null,null,"Schützen:",null,null,{"$f":"MC16_Baum!$C$40","v":"Schütze1_CM7 Schütze2_CM7"}]
["Datum"]
["Bewerb:",null,{"$f":"Select!$C$14","v":"Mannschaftsbewerb"},null,null,null,null,null,null,null,null,null,"Bogenklasse:",null,null,{"$f":"Select!$C$20","v":"Compound Damen"}]
[]
[]
["1/8 Elimination",null,null,null,null,{"$f":"MC16_Baum!$C$67","v":"Scheibe: 63"},null,null,null,null,null,null,"1/4 Finale",null,null,null,null,{"$f":"MC16_Baum!$G$61","v":"Scheibe: 47"}]
[null,1,2,"Summe","Gesamt",null,null,null,null,null,null,null,null,1,2,"Summe","Gesamt"]
[1,null,null,null,null,null,null,null,null,null,null,null,1]
[]
[]
[2,null,null,null,null,null,null,null,null,null,null,null,2]
[]
[null,null,null,null,null,null,"Stechen (wenn erf.)",null,null,null,null,null,null,null,null,null,null,null,"Stechen (wenn erf.)"]
[3,null,null,null,null,null,1,null,null,null,null,null,3,null,null,null,null,null,1]
[null,null,null,null,null,null,2,null,null,null,null,null,null,null,null,null,null,null,2]
[null,null,null,null,null,null,3,null,null,null,null,null,null,null,null,null,null,null,3]
[4,null,null,null,null,null,null,null,null,null,null,null,4]
[]
[null,null,null,null,null,null,null,"gewonnen",null,null,null,null,null,null,null,null,null,null,null,"gewonnen"]
[null,null,null,null,null,null,null,"verloren",null,null,null,null,null,null,null,null,null,null,null,"verloren"]
[]
[null,"Schreiber:",null,null,null,null,"Kontrolle:",null,null,null,null,null,null,"Schreiber:",null,null,null,null,"Kontrolle:"]
[]
[]
["1/2 Finale",null,null,null,null,{"$f":"MC16_Baum!$K$58","v":"Scheibe: 34"},null,null,null,null,null,null,"1./2. od. 3./4. Platz",null,null,null,null,"Scheibe:"]
[null,1,2,"Summe","Gesamt",null,null,null,null,null,null,null,null,1,2,"Summe","Gesamt"]
[1,null,null,null,null,null,null,null,null,null,null,null,1]
[]
[]
[2,null,null,null,null,null,null,null,null,null,null,null,2]
[]
[null,null,null,null,null,null,"Stechen (wenn erf.)",null,null,null,null,null,null,null,null,null,null,null,"Stechen (wenn erf.)"]
[3,null,null,null,null,null,1,null,null,null,null,null,3,null,null,null,null,null,1]
[null,null,null,null,null,null,2,null,null,null,null,null,null,null,null,null,null,null,2]
[null,null,null,null,null,null,3,null,null,null,null,null,null,null,null,null,null,null,3]
[4,null,null,null,null,null,null,null,null,null,null,null,4]
[]
[null,null,null,null,null,null,null,"gewonnen",null,null,null,null,null,null,null,null,null,null,null,"gewonnen"]
[null,null,null,null,null,null,null,"verloren",null,null,null,null,null,null,null,null,null,null,null,"verloren"]
[]
[null,"Schreiber:",null,null,null,null,"Kontrolle:",null,null,null,null,null,null,"Schreiber:",null,null,null,null,"Kontrolle:"]
[]
[]
[]
[{"$f":"Select!$C$12","v":"ÖM Indoor 2019"},null,null,null,null,null,null,null,null,null,null,null,"Mannschaft:",null,null,{"$f":"MC16_Baum!$C$41","v":"CM_10"}]
["Veranstaltung"]
[{"$f":"Select!$C$13","v":"09.-10. Februar 2019"},null,null,null,null,null,null,null,null,null,null,null,"Schützen:",null,null,{"$f":"MC16_Baum!$C$42","v":"Schütze1_CM10 Schütze2_CM10"}]
["Datum"]
["Bewerb:",null,{"$f":"Select!$C$14","v":"Mannschaftsbewerb"},null,null,null,null,null,null,null,null,null,"Bogenklasse:",null,null,{"$f":"Select!$C$20","v":"Compound Damen"}]
[]
[]
["1/8 Elimination",null,null,null,null,{"$f":"MC16_Baum!$C$68","v":"Scheibe: 64"},null,null,null,null,null,null,"1/4 Finale",null,null,null,null,{"$f":"MC16_Baum!$G$61","v":"Scheibe: 47"}]
[null,1,2,"Summe","Gesamt",null,null,null,null,null,null,null,null,1,2,"Summe","Gesamt"]
[1,null,null,null,null,null,null,null,null,null,null,null,1]
[]
[]
[2,null,null,null,null,null,null,null,null,null,null,null,2]
[]
[null,null,null,null,null,null,"Stechen (wenn erf.)",null,null,null,null,null,null,null,null,null,null,null,"Stechen (wenn erf.)"]
[3,null,null,null,null,null,1,null,null,null,null,null,3,null,null,null,null,null,1]
[null,null,null,null,null,null,2,null,null,null,null,null,null,null,null,null,null,null,2]
[null,null,null,null,null,null,3,null,null,null,null,null,null,null,null,null,null,null,3]
[4,null,null,null,null,null,null,null,null,null,null,null,4]
[]
[null,null,null,null,null,null,null,"gewonnen",null,null,null,null,null,null,null,null,null,null,null,"gewonnen"]
[null,null,null,null,null,null,null,"verloren",null,null,null,null,null,null,null,null,null,null,null,"verloren"]
[]
[null,"Schreiber:",null,null,null,null,"Kontrolle:",null,null,null,null,null,null,"Schreiber:",null,null,null,null,"Kontrolle:"]
[]
[]
["1/2 Finale",null,null,null,null,{"$f":"MC16_Baum!$K$58","v":"Scheibe: 34"},null,null,null,null,null,null,"1./2. od. 3./4. Platz",null,null,null,null,"Scheibe:"]
[null,1,2,"Summe","Gesamt",null,null,null,null,null,null,null,null,1,2,"Summe","Gesamt"]
[1,null,null,null,null,null,null,null,null,null,null,null,1]
[]
[]
[2,null,null,null,null,null,null,null,null,null,null,null,2]
[]
[null,null,null,null,null,null,"Stechen (wenn erf.)",null,null,null,null,null,null,null,null,null,null,null,"Stechen (wenn erf.)"]
[3,null,null,null,null,null,1,null,null,null,null,null,3,null,null,null,null,null,1]
[null,null,null,null,null,null,2,null,null,null,null,null,null,null,null,null,null,null,2]
[null,null,null,null,null,null,3,null,null,null,null,null,null,null,null,null,null,null,3]
[4,null,null,null,null,null,null,null,null,null,null,null,4]
[]
[null,null,null,null,null,null,null,"gewonnen",null,null,null,null,null,null,null,null,null,null,null,"gewonnen"]
[null,null,null,null,null,null,null,"verloren",null,null,null,null,null,null,null,null,null,null,null,"verloren"]
[]
[null,"Schreiber:",null,null,null,null,"Kontrolle:",null,null,null,null,null,null,"Schreiber:",null,null,null,null,"Kontrolle:"]
[]
[]
[]
[{"$f":"Select!$C$12","v":"ÖM Indoor 2019"},null,null,null,null,null,null,null,null,null,null,null,"Mannschaft:",null,null,{"$f":"MC16_Baum!$C$45","v":"CM_15"}]
["Veranstaltung"]
[{"$f":"Select!$C$13","v":"09.-10. Februar 2019"},null,null,null,null,null,null,null,null,null,null,null,"Schützen:",null,null,{"$f":"MC16_Baum!$C$46","v":"Schütze1_CM15 Schütze2_CM15"}]
["Datum"]
["Bewerb:",null,{"$f":"Select!$C$14","v":"Mannschaftsbewerb"},null,null,null,null,null,null,null,null,null,"Bogenklasse:",null,null,{"$f":"Select!$C$20","v":"Compound Damen"}]
[]
[]
["1/8 Elimination",null,null,null,null,{"$f":"MC16_Baum!$C$69","v":"Scheibe: 65"},null,null,null,null,null,null,"1/4 Finale",null,null,null,null,{"$f":"MC16_Baum!$G$62","v":"Scheibe: 48"}]
[null,1,2,"Summe","Gesamt",null,null,null,null,null,null,null,null,1,2,"Summe","Gesamt"]
[1,null,null,null,null,null,null,null,null,null,null,null,1]
[]
[]
[2,null,null,null,null,null,null,null,null,null,null,null,2]
[]
[null,null,null,null,null,null,"Stechen (wenn erf.)",null,null,null,null,null,null,null,null,null,null,null,"Stechen (wenn erf.)"]
[3,null,null,null,null,null,1,null,null,null,null,null,3,null,null,null,null,null,1]
[null,null,null,null,null,null,2,null,null,null,null,null,null,null,null,null,null,null,2]
[null,null,null,null,null,null,3,null,null,null,null,null,null,null,null,null,null,null,3]
[4,null,null,null,null,null,null,null,null,null,null,null,4]
[]
[null,null,null,null,null,null,null,"gewonnen",null,null,null,null,null,null,null,null,null,null,null,"gewonnen"]
[null,null,null,null,null,null,null,"verloren",null,null,null,null,null,null,null,null,null,null,null,"verloren"]
[]
[null,"Schreiber:",null,null,null,null,"Kontrolle:",null,null,null,null,null,null,"Schreiber:",null,null,null,null,"Kontrolle:"]
[]
[]
["1/2 Finale",null,null,null,null,{"$f":"MC16_Baum!$K$58","v":"Scheibe: 34"},null,null,null,null,null,null,"1./2. od. 3./4. Platz",null,null,null,null,"Scheibe:"]
[null,1,2,"Summe","Gesamt",null,null,null,null,null,null,null,null,1,2,"Summe","Gesamt"]
[1,null,null,null,null,null,null,null,null,null,null,null,1]
[]
[]
[2,null,null,null,null,null,null,null,null,null,null,null,2]
[]
[null,null,null,null,null,null,"Stechen (wenn erf.)",null,null,null,null,null,null,null,null,null,null,null,"Stechen (wenn erf.)"]
[3,null,null,null,null,null,1,null,null,null,null,null,3,null,null,null,null,null,1]
[null,null,null,null,null,null,2,null,null,null,null,null,null,null,null,null,null,null,2]
[null,null,null,null,null,null,3,null,null,null,null,null,null,null,null,null,null,null,3]
[4,null,null,null,null,null,null,null,null,null,null,null,4]
[]
[null,null,null,null,null,null,null,"gewonnen",null,null,null,null,null,null,null,null,null,null,null,"gewonnen"]
[null,null,null,null,null,null,null,"verloren",null,null,null,null,null,null,null,null,null,null,null,"verloren"]
[]
[null,"Schreiber:",null,null,null,null,"Kontrolle:",null,null,null,null,null,null,"Schreiber:",null,null,null,null,"Kontrolle:"]
[]
[]
[]
[{"$f":"Select!$C$12","v":"ÖM Indoor 2019"},null,null,null,null,null,null,null,null,null,null,null,"Mannschaft:",null,null,{"$f":"MC16_Baum!$C$47","v":"CM_2"}]
["Veranstaltung"]
[{"$f":"Select!$C$13","v":"09.-10. Februar 2019"},null,null,null,null,null,null,null,null,null,null,null,"Schützen:",null,null,{"$f":"MC16_Baum!$C$48","v":"Schütze1_CM2 Schütze2_CM2"}]
["Datum"]
["Bewerb:",null,{"$f":"Select!$C$14","v":"Mannschaftsbewerb"},null,null,null,null,null,null,null,null,null,"Bogenklasse:",null,null,{"$f":"Select!$C$20","v":"Compound Damen"}]
[]
[]
["1/8 Elimination",null,null,null,null,{"$f":"MC16_Baum!$C$70","v":"Scheibe: 66"},null,null,null,null,null,null,"1/4 Finale",null,null,null,null,{"$f":"MC16_Baum!$G$62","v":"Scheibe: 48"}]
[null,1,2,"Summe","Gesamt",null,null,null,null,null,null,null,null,1,2,"Summe","Gesamt"]
[1,null,null,null,null,null,null,null,null,null,null,null,1]
[]
[]
[2,null,null,null,null,null,null,null,null,null,null,null,2]
[]
[null,null,null,null,null,null,"Stechen (wenn erf.)",null,null,null,null,null,null,null,null,null,null,null,"Stechen (wenn erf.)"]
[3,null,null,null,null,null,1,null,null,null,null,null,3,null,null,null,null,null,1]
[null,null,null,null,null,null,2,null,null,null,null,null,null,null,null,null,null,null,2]
[null,null,null,null,null,null,3,null,null,null,null,null,null,null,null,null,null,null,3]
[4,null,null,null,null,null,null,null,null,null,null,null,4]
[]
[null,null,null,null,null,null,null,"gewonnen",null,null,null,null,null,null,null,null,null,null,null,"gewonnen"]
[null,null,null,null,null,null,null,"verloren",null,null,null,null,null,null,null,null,null,null,null,"verloren"]
[]
[null,"Schreiber:",null,null,null,null,"Kontrolle:",null,null,null,null,null,null,"Schreiber:",null,null,null,null,"Kontrolle:"]
[]
[]
["1/2 Finale",null,null,null,null,{"$f":"MC16_Baum!$K$58","v":"Scheibe: 34"},null,null,null,null,null,null,"1./2. od. 3./4. Platz",null,null,null,null,"Scheibe:"]
[null,1,2,"Summe","Gesamt",null,null,null,null,null,null,null,null,1,2,"Summe","Gesamt"]
[1,null,null,null,null,null,null,null,null,null,null,null,1]
[]
[]
[2,null,null,null,null,null,null,null,null,null,null,null,2]
[]
[null,null,null,null,null,null,"Stechen (wenn erf.)",null,null,null,null,null,null,null,null,null,null,null,"Stechen (wenn erf.)"]
[3,null,null,null,null,null,1,null,null,null,null,null,3,null,null,null,null,null,1]
[null,null,null,null,null,null,2,null,null,null,null,null,null,null,null,null,null,null,2]
[null,null,null,null,null,null,3,null,null,null,null,null,null,null,null,null,null,null,3]
[4,null,null,null,null,null,null,null,null,null,null,null,4]
[]
[null,null,null,null,null,null,null,"gewonnen",null,null,null,null,null,null,null,null,null,null,null,"gewonnen"]
[null,null,null,null,null,null,null,"verloren",null,null,null,null,null,null,null,null,null,null,null,"verloren"]
[]
[null,"Schreiber:",null,null,null,null,"Kontrolle:",null,null,null,null,null,null,"Schreiber:",null,null,null,null,"Kontrolle:"]

{"sheet":"MCX16","index":17,"n_rows":638,"n_cols":20,"rows_kept":638,"cut":false,"hidden":true,"merged":[[5,15,5,21],[9,0,9,4],[9,5,9,10],[9,12,9,16],[9,17,9,22],[11,0,12,0],[11,12,12,12],[1,0,1,9],[1,15,1,21],[2,0,2,9],[3,0,3,9],[3,15,4,21],[4,0,4,9],[5,2,5,10],[25,17,25,22],[27,0,28,0],[27,12,28,12],[13,0,14,0],[13,12,14,12],[15,0,16,0],[15,12,16,12],[17,0,18,0],[17,12,18,12],[29,0,30,0],[29,12,30,12],[31,0,32,0],[31,12,32,12],[33,0,34,0],[33,12,34,12],[25,0,25,4],[25,5,25,10],[25,12,25,16],[45,15,45,21],[49,0,49,4],[49,5,49,10],[49,12,49,16],[49,17,49,22],[51,0,52,0],[51,12,52,12],[41,0,41,9],[41,15,41,21],[42,0,42,9],[43,0,43,9],[43,15,44,21],[44,0,44,9],[45,2,45,10],[65,17,65,22],[67,0,68,0],[67,12,68,12],[53,0,54,0],[53,12,54,12],[55,0,56,0],[55,12,56,12],[57,0,58,0],[57,12,58,12],[69,0,70,0],[69,12,70,12],[71,0,72,0],[71,12,72,12],[73,0,74,0],[73,12,74,12],[65,0,65,4],[65,5,65,10],[65,12,65,16],[85,15,85,21],[89,0,89,4],[89,5,89,10],[89,12,89,16],[89,17,89,22],[91,0,92,0],[91,12,92,12],[81,0,81,9],[81,15,81,21],[82,0,82,9],[83,0,83,9],[83,15,84,21],[84,0,84,9],[85,2,85,10],[105,17,105,22],[107,0,108,0],[107,12,108,12],[93,0,94,0],[93,12,94,12],[95,0,96,0],[95,12,96,12],[97,0,98,0],[97,12,98,12],[109,0,110,0],[109,12,110,12],[111,0,112,0],[111,12,112,12],[113,0,114,0],[113,12,114,12],[105,0,105,4],[105,5,105,10],[105,12,105,16],[125,15,125,21],[129,0,129,4],[129,5,129,10],[129,12,129,16],[129,17,129,22],[131,0,132,0],[131,12,132,12],[121,0,121,9],[121,15,121,21],[122,0,122,9],[123,0,123,9],[123,15,124,21],[124,0,124,9],[125,2,125,10],[145,17,145,22],[147,0,148,0],[147,12,148,12],[133,0,134,0],[133,12,134,12],[135,0,136,0],[135,12,136,12],[137,0,138,0],[137,12,138,12],[149,0,150,0],[149,12,150,12],[151,0,152,0],[151,12,152,12],[153,0,154,0],[153,12,154,12],[145,0,145,4],[145,5,145,10],[145,12,145,16],[165,15,165,21],[169,0,169,4],[169,5,169,10],[169,12,169,16],[169,17,169,22],[171,0,172,0],[171,12,172,12],[161,0,161,9],[161,15,161,21],[162,0,162,9],[163,0,163,9],[163,15,164,21],[164,0,164,9],[165,2,165,10],[185,17,185,22],[187,0,188,0],[187,12,188,12],[173,0,174,0],[173,12,174,12],[175,0,176,0],[175,12,176,12],[177,0,178,0],[177,12,178,12],[189,0,190,0],[189,12,190,12],[191,0,192,0],[191,12,192,12],[193,0,194,0],[193,12,194,12],[185,0,185,4],[185,5,185,10],[185,12,185,16],[205,15,205,21],[209,0,209,4],[209,5,209,10],[209,12,209,16],[209,17,209,22],[211,0,212,0],[211,12,212,12],[201,0,201,9],[201,15,201,21],[202,0,202,9],[203,0,203,9],[203,15,204,21],[204,0,204,9],[205,2,205,10],[225,17,225,22],[227,0,228,0],[227,12,228,12],[213,0,214,0],[213,12,214,12],[215,0,216,0],[215,12,216,12],[217,0,218,0],[217,12,218,12],[229,0,230,0],[229,12,230,12],[231,0,232,0],[231,12,232,12],[233,0,234,0],[233,12,234,12],[225,0,225,4],[225,5,225,10],[225,12,225,16],[245,15,245,21],[249,0,249,4],[249,5,249,10],[249,12,249,16],[249,17,249,22],[251,0,252,0],[251,12,252,12],[241,0,241,9],[241,15,241,21],[242,0,242,9],[243,0,243,9],[243,15,244,21],[244,0,244,9],[245,2,245,10],[265,17,265,22],[267,0,268,0],[267,12,268,12],[253,0,254,0],[253,12,254,12],[255,0,256,0],[255,12,256,12],[257,0,258,0],[257,12,258,12],[269,0,270,0],[269,12,270,12],[271,0,272,0],[271,12,272,12],[273,0,274,0],[273,12,274,12],[265,0,265,4],[265,5,265,10],[265,12,265,16],[285,15,285,21],[289,0,289,4],[289,5,289,10],[289,12,289,16],[289,17,289,22],[291,0,292,0],[291,12,292,12],[281,0,281,9],[281,15,281,21],[282,0,282,9],[283,0,283,9],[283,15,284,21],[284,0,284,9],[285,2,285,10],[305,17,305,22],[307,0,308,0],[307,12,308,12],[293,0,294,0],[293,12,294,12],[295,0,296,0],[295,12,296,12],[297,0,298,0],[297,12,298,12],[309,0,310,0],[309,12,310,12],[311,0,312,0],[311,12,312,12],[313,0,314,0],[313,12,314,12],[305,0,305,4],[305,5,305,10],[305,12,305,16],[325,15,325,21],[329,0,329,4],[329,5,329,10],[329,12,329,16],[329,17,329,22],[331,0,332,0],[331,12,332,12],[321,0,321,9],[321,15,321,21],[322,0,322,9],[323,0,323,9],[323,15,324,21],[324,0,324,9],[325,2,325,10],[345,17,345,22],[347,0,348,0],[347,12,348,12],[333,0,334,0],[333,12,334,12],[335,0,336,0],[335,12,336,12],[337,0,338,0],[337,12,338,12],[349,0,350,0],[349,12,350,12],[351,0,352,0],[351,12,352,12],[353,0,354,0],[353,12,354,12],[345,0,345,4],[345,5,345,10],[345,12,345,16],[365,15,365,21],[369,0,369,4],[369,5,369,10],[369,12,369,16],[369,17,369,22],[371,0,372,0],[371,12,372,12],[361,0,361,9],[361,15,361,21],[362,0,362,9],[363,0,363,9],[363,15,364,21],[364,0,364,9],[365,2,365,10],[385,17,385,22],[387,0,388,0],[387,12,388,12],[373,0,374,0],[373,12,374,12],[375,0,376,0],[375,12,376,12],[377,0,378,0],[377,12,378,12],[389,0,390,0],[389,12,390,12],[391,0,392,0],[391,12,392,12],[393,0,394,0],[393,12,394,12],[385,0,385,4],[385,5,385,10],[385,12,385,16],[405,15,405,21],[409,0,409,4],[409,5,409,10],[409,12,409,16],[409,17,409,22],[411,0,412,0],[411,12,412,12],[401,0,401,9],[401,15,401,21],[402,0,402,9],[403,0,403,9],[403,15,404,21],[404,0,404,9],[405,2,405,10],[425,17,425,22],[427,0,428,0],[427,12,428,12],[413,0,414,0],[413,12,414,12],[415,0,416,0],[415,12,416,12],[417,0,418,0],[417,12,418,12],[429,0,430,0],[429,12,430,12],[431,0,432,0],[431,12,432,12],[433,0,434,0],[433,12,434,12],[425,0,425,4],[425,5,425,10],[425,12,425,16],[445,15,445,21],[449,0,449,4],[449,5,449,10],[449,12,449,16],[449,17,449,22],[451,0,452,0],[451,12,452,12],[441,0,441,9],[441,15,441,21],[442,0,442,9],[443,0,443,9],[443,15,444,21],[444,0,444,9],[445,2,445,10],[465,17,465,22],[467,0,468,0],[467,12,468,12],[453,0,454,0],[453,12,454,12],[455,0,456,0],[455,12,456,12],[457,0,458,0],[457,12,458,12],[469,0,470,0],[469,12,470,12],[471,0,472,0],[471,12,472,12],[473,0,474,0],[473,12,474,12],[465,0,465,4],[465,5,465,10],[465,12,465,16],[485,15,485,21],[489,0,489,4],[489,5,489,10],[489,12,489,16],[489,17,489,22],[491,0,492,0],[491,12,492,12],[481,0,481,9],[481,15,481,21],[482,0,482,9],[483,0,483,9],[483,15,484,21],[484,0,484,9],[485,2,485,10],[505,17,505,22],[507,0,508,0],[507,12,508,12],[493,0,494,0],[493,12,494,12],[495,0,496,0],[495,12,496,12],[497,0,498,0],[497,12,498,12],[509,0,510,0],[509,12,510,12],[511,0,512,0],[511,12,512,12],[513,0,514,0],[513,12,514,12],[505,0,505,4],[505,5,505,10],[505,12,505,16],[525,15,525,21],[529,0,529,4],[529,5,529,10],[529,12,529,16],[529,17,529,22],[531,0,532,0],[531,12,532,12],[521,0,521,9],[521,15,521,21],[522,0,522,9],[523,0,523,9],[523,15,524,21],[524,0,524,9],[525,2,525,10],[545,17,545,22],[547,0,548,0],[547,12,548,12],[533,0,534,0],[533,12,534,12],[535,0,536,0],[535,12,536,12],[537,0,538,0],[537,12,538,12],[549,0,550,0],[549,12,550,12],[551,0,552,0],[551,12,552,12],[553,0,554,0],[553,12,554,12],[545,0,545,4],[545,5,545,10],[545,12,545,16],[565,15,565,21],[569,0,569,4],[569,5,569,10],[569,12,569,16],[569,17,569,22],[571,0,572,0],[571,12,572,12],[561,0,561,9],[561,15,561,21],[562,0,562,9],[563,0,563,9],[563,15,564,21],[564,0,564,9],[565,2,565,10],[585,17,585,22],[587,0,588,0],[587,12,588,12],[573,0,574,0],[573,12,574,12],[575,0,576,0],[575,12,576,12],[577,0,578,0],[577,12,578,12],[589,0,590,0],[589,12,590,12],[591,0,592,0],[591,12,592,12],[593,0,594,0],[593,12,594,12],[585,0,585,4],[585,5,585,10],[585,12,585,16],[605,15,605,21],[609,0,609,4],[609,5,609,10],[609,12,609,16],[609,17,609,22],[611,0,612,0],[611,12,612,12],[601,0,601,9],[601,15,601,21],[602,0,602,9],[603,0,603,9],[603,15,604,21],[604,0,604,9],[605,2,605,10],[625,17,625,22],[627,0,628,0],[627,12,628,12],[613,0,614,0],[613,12,614,12],[615,0,616,0],[615,12,616,12],[617,0,618,0],[617,12,618,12],[629,0,630,0],[629,12,630,12],[631,0,632,0],[631,12,632,12],[633,0,634,0],[633,12,634,12],[625,0,625,4],[625,5,625,10],[625,12,625,16]]}
[]
[{"$f":"Select!$C$12","v":"ÖM Indoor 2019"},null,null,null,null,null,null,null,null,null,null,null,"Mannschaft:",null,null,{"$f":"MC16_Baum!$C$3","v":"CM_1"}]
["Veranstaltung"]
[{"$f":"Select!$C$13","v":"09.-10. Februar 2019"},null,null,null,null,null,null,null,null,null,null,null,"Schützen:",null,null,{"$f":"MC16_Baum!$C$4","v":"Schütze1_CM1 Schütze2_CM1"}]
["Datum"]
["Bewerb:",null,{"$f":"Select!$C$14","v":"Mannschaftsbewerb"},null,null,null,null,null,null,null,null,null,"Bogenklasse:",null,null,{"$f":"Select!$C$20","v":"Compound Damen"}]
[]
[]
[]
["1/8 Elimination",null,null,null,null,{"$f":"MC16_Baum!$C$55","v":"Scheibe: 51"},null,null,null,null,null,null,"1/4 Finale",null,null,null,null,{"$f":"MC16_Baum!$G$55","v":"Scheibe: 41"}]
[null,1,2,"Summe","Gesamt",null,null,null,null,null,null,null,null,1,2,"Summe","Gesamt"]
[1,null,null,null,null,null,null,null,null,null,null,null,1]
[]
[2,null,null,null,null,null,null,null,null,null,null,null,2]
[null,null,null,null,null,null,"Stechen (wenn erf.)",null,null,null,null,null,null,null,null,null,null,null,"Stechen (wenn erf.)"]
[3,null,null,null,null,null,1,null,null,null,null,null,3,null,null,null,null,null,1]
[null,null,null,null,null,null,2,null,null,null,null,null,null,null,null,null,null,null,2]
[4,null,null,null,null,null,null,null,null,null,null,null,4]
[null,null,null,null,null,null,null,"gewonnen",null,null,null,null,null,null,null,null,null,null,null,"gewonnen"]
[null,null,null,null,null,null,null,"verloren",null,null,null,null,null,null,null,null,null,null,null,"verloren"]
[]
[null,"Schreiber:",null,null,null,null,"Kontrolle:",null,null,null,null,null,null,"Schreiber:",null,null,null,null,"Kontrolle:"]
[]
[]
[]
["1/2 Finale",null,null,null,null,{"$f":"MC16_Baum!$K$55","v":"Scheibe: 31"},null,null,null,null,null,null,"1./2. od. 3./4. Platz",null,null,null,null,"Scheibe:"]
[null,1,2,"Summe","Gesamt",null,null,null,null,null,null,null,null,1,2,"Summe","Gesamt"]
[1,null,null,null,null,null,null,null,null,null,null,null,1]
[]
[2,null,null,null,null,null,null,null,null,null,null,null,2]
[null,null,null,null,null,null,"Stechen (wenn erf.)",null,null,null,null,null,null,null,null,null,null,null,"Stechen (wenn erf.)"]
[3,null,null,null,null,null,1,null,null,null,null,null,3,null,null,null,null,null,1]
[null,null,null,null,null,null,2,null,null,null,null,null,null,null,null,null,null,null,2]
[4,null,null,null,null,null,null,null,null,null,null,null,4]
[null,null,null,null,null,null,null,"gewonnen",null,null,null,null,null,null,null,null,null,null,null,"gewonnen"]
[null,null,null,null,null,null,null,"verloren",null,null,null,null,null,null,null,null,null,null,null,"verloren"]
[]
[null,"Schreiber:",null,null,null,null,"Kontrolle:",null,null,null,null,null,null,"Schreiber:",null,null,null,null,"Kontrolle:"]
[]
[]
[]
[{"$f":"Select!$C$12","v":"ÖM Indoor 2019"},null,null,null,null,null,null,null,null,null,null,null,"Mannschaft:",null,null,{"$f":"MC16_Baum!$C$5","v":"CM_16"}]
["Veranstaltung"]
[{"$f":"Select!$C$13","v":"09.-10. Februar 2019"},null,null,null,null,null,null,null,null,null,null,null,"Schützen:",null,null,{"$f":"MC16_Baum!$C$6","v":"Schütze1_CM16  Schütze2_CM16"}]
["Datum"]
["Bewerb:",null,{"$f":"Select!$C$14","v":"Mannschaftsbewerb"},null,null,null,null,null,null,null,null,null,"Bogenklasse:",null,null,{"$f":"Select!$C$20","v":"Compound Damen"}]
[]
[]
[]
["1/8 Elimination",null,null,null,null,{"$f":"MC16_Baum!$C$56","v":"Scheibe: 52"},null,null,null,null,null,null,"1/4 Finale",null,null,null,null,{"$f":"MC16_Baum!$G$55","v":"Scheibe: 41"}]
[null,1,2,"Summe","Gesamt",null,null,null,null,null,null,null,null,1,2,"Summe","Gesamt"]
[1,null,null,null,null,null,null,null,null,null,null,null,1]
[]
[2,null,null,null,null,null,null,null,null,null,null,null,2]
[null,null,null,null,null,null,"Stechen (wenn erf.)",null,null,null,null,null,null,null,null,null,null,null,"Stechen (wenn erf.)"]
[3,null,null,null,null,null,1,null,null,null,null,null,3,null,null,null,null,null,1]
[null,null,null,null,null,null,2,null,null,null,null,null,null,null,null,null,null,null,2]
[4,null,null,null,null,null,null,null,null,null,null,null,4]
[null,null,null,null,null,null,null,"gewonnen",null,null,null,null,null,null,null,null,null,null,null,"gewonnen"]
[null,null,null,null,null,null,null,"verloren",null,null,null,null,null,null,null,null,null,null,null,"verloren"]
[]
[null,"Schreiber:",null,null,null,null,"Kontrolle:",null,null,null,null,null,null,"Schreiber:",null,null,null,null,"Kontrolle:"]
[]
[]
[]
["1/2 Finale",null,null,null,null,{"$f":"MC16_Baum!$K$55","v":"Scheibe: 31"},null,null,null,null,null,null,"1./2. od. 3./4. Platz",null,null,null,null,"Scheibe:"]
[null,1,2,"Summe","Gesamt",null,null,null,null,null,null,null,null,1,2,"Summe","Gesamt"]
[1,null,null,null,null,null,null,null,null,null,null,null,1]
[]
[2,null,null,null,null,null,null,null,null,null,null,null,2]
[null,null,null,null,null,null,"Stechen (wenn erf.)",null,null,null,null,null,null,null,null,null,null,null,"Stechen (wenn erf.)"]
[3,null,null,null,null,null,1,null,null,null,null,null,3,null,null,null,null,null,1]
[null,null,null,null,null,null,2,null,null,null,null,null,null,null,null,null,null,null,2]
[4,null,null,null,null,null,null,null,null,null,null,null,4]
[null,null,null,null,null,null,null,"gewonnen",null,null,null,null,null,null,null,null,null,null,null,"gewonnen"]
[null,null,null,null,null,null,null,"verloren",null,null,null,null,null,null,null,null,null,null,null,"verloren"]
[]
[null,"Schreiber:",null,null,null,null,"Kontrolle:",null,null,null,null,null,null,"Schreiber:",null,null,null,null,"Kontrolle:"]
[]
[]
[]
[{"$f":"Select!$C$12","v":"ÖM Indoor 2019"},null,null,null,null,null,null,null,null,null,null,null,"Mannschaft:",null,null,{"$f":"MC16_Baum!$C$9","v":"CM_9"}]
["Veranstaltung"]
[{"$f":"Select!$C$13","v":"09.-10. Februar 2019"},null,null,null,null,null,null,null,null,null,null,null,"Schützen:",null,null,{"$f":"MC16_Baum!$C$10","v":"Schütze1_CM9 Schütze2_CM9"}]
["Datum"]
["Bewerb:",null,{"$f":"Select!$C$14","v":"Mannschaftsbewerb"},null,null,null,null,null,null,null,null,null,"Bogenklasse:",null,null,{"$f":"Select!$C$20","v":"Compound Damen"}]
[]
[]
[]
["1/8 Elimination",null,null,null,null,{"$f":"MC16_Baum!$C$57","v":"Scheibe: 53"},null,null,null,null,null,null,"1/4 Finale",null,null,null,null,{"$f":"MC16_Baum!$G$56","v":"Scheibe: 42"}]
[null,1,2,"Summe","Gesamt",null,null,null,null,null,null,null,null,1,2,"Summe","Gesamt"]
[1,null,null,null,null,null,null,null,null,null,null,null,1]
[]
[2,null,null,null,null,null,null,null,null,null,null,null,2]
[null,null,null,null,null,null,"Stechen (wenn erf.)",null,null,null,null,null,null,null,null,null,null,null,"Stechen (wenn erf.)"]
[3,null,null,null,null,null,1,null,null,null,null,null,3,null,null,null,null,null,1]
[null,null,null,null,null,null,2,null,null,null,null,null,null,null,null,null,null,null,2]
[4,null,null,null,null,null,null,null,null,null,null,null,4]
[null,null,null,null,null,null,null,"gewonnen",null,null,null,null,null,null,null,null,null,null,null,"gewonnen"]
[null,null,null,null,null,null,null,"verloren",null,null,null,null,null,null,null,null,null,null,null,"verloren"]
[]
[null,"Schreiber:",null,null,null,null,"Kontrolle:",null,null,null,null,null,null,"Schreiber:",null,null,null,null,"Kontrolle:"]
[]
[]
[]
["1/2 Finale",null,null,null,null,{"$f":"MC16_Baum!$K$55","v":"Scheibe: 31"},null,null,null,null,null,null,"1./2. od. 3./4. Platz",null,null,null,null,"Scheibe:"]
[null,1,2,"Summe","Gesamt",null,null,null,null,null,null,null,null,1,2,"Summe","Gesamt"]
[1,null,null,null,null,null,null,null,null,null,null,null,1]
[]
[2,null,null,null,null,null,null,null,null,null,null,null,2]
[null,null,null,null,null,null,"Stechen (wenn erf.)",null,null,null,null,null,null,null,null,null,null,null,"Stechen (wenn erf.)"]
[3,null,null,null,null,null,1,null,null,null,null,null,3,null,null,null,null,null,1]
[null,null,null,null,null,null,2,null,null,null,null,null,null,null,null,null,null,null,2]
[4,null,null,null,null,null,null,null,null,null,null,null,4]
[null,null,null,null,null,null,null,"gewonnen",null,null,null,null,null,null,null,null,null,null,null,"gewonnen"]
[null,null,null,null,null,null,null,"verloren",null,null,null,null,null,null,null,null,null,null,null,"verloren"]
[]
[null,"Schreiber:",null,null,null,null,"Kontrolle:",null,null,null,null,null,null,"Schreiber:",null,null,null,null,"Kontrolle:"]
[]
[]
[]
[{"$f":"Select!$C$12","v":"ÖM Indoor 2019"},null,null,null,null,null,null,null,null,null,null,null,"Mannschaft:",null,null,{"$f":"MC16_Baum!$C$11","v":"CM_8"}]
["Veranstaltung"]
[{"$f":"Select!$C$13","v":"09.-10. Februar 2019"},null,null,null,null,null,null,null,null,null,null,null,"Schützen:",null,null,{"$f":"MC16_Baum!$C$12","v":"Schütze1_CM8 Schütze2_CM8"}]
["Datum"]
["Bewerb:",null,{"$f":"Select!$C$14","v":"Mannschaftsbewerb"},null,null,null,null,null,null,null,null,null,"Bogenklasse:",null,null,{"$f":"Select!$C$20","v":"Compound Damen"}]
[]
[]
[]
["1/8 Elimination",null,null,null,null,{"$f":"MC16_Baum!$C$58","v":"Scheibe: 54"},null,null,null,null,null,null,"1/4 Finale",null,null,null,null,{"$f":"MC16_Baum!$G$56","v":"Scheibe: 42"}]
[null,1,2,"Summe","Gesamt",null,null,null,null,null,null,null,null,1,2,"Summe","Gesamt"]
[1,null,null,null,null,null,null,null,null,null,null,null,1]
[]
[2,null,null,null,null,null,null,null,null,null,null,null,2]
[null,null,null,null,null,null,"Stechen (wenn erf.)",null,null,null,null,null,null,null,null,null,null,null,"Stechen (wenn erf.)"]
[3,null,null,null,null,null,1,null,null,null,null,null,3,null,null,null,null,null,1]
[null,null,null,null,null,null,2,null,null,null,null,null,null,null,null,null,null,null,2]
[4,null,null,null,null,null,null,null,null,null,null,null,4]
[null,null,null,null,null,null,null,"gewonnen",null,null,null,null,null,null,null,null,null,null,null,"gewonnen"]
[null,null,null,null,null,null,null,"verloren",null,null,null,null,null,null,null,null,null,null,null,"verloren"]
[]
[null,"Schreiber:",null,null,null,null,"Kontrolle:",null,null,null,null,null,null,"Schreiber:",null,null,null,null,"Kontrolle:"]
[]
[]
[]
["1/2 Finale",null,null,null,null,{"$f":"MC16_Baum!$K$55","v":"Scheibe: 31"},null,null,null,null,null,null,"1./2. od. 3./4. Platz",null,null,null,null,"Scheibe:"]
[null,1,2,"Summe","Gesamt",null,null,null,null,null,null,null,null,1,2,"Summe","Gesamt"]
[1,null,null,null,null,null,null,null,null,null,null,null,1]
[]
[2,null,null,null,null,null,null,null,null,null,null,null,2]
[null,null,null,null,null,null,"Stechen (wenn erf.)",null,null,null,null,null,null,null,null,null,null,null,"Stechen (wenn erf.)"]
[3,null,null,null,null,null,1,null,null,null,null,null,3,null,null,null,null,null,1]
[null,null,null,null,null,null,2,null,null,null,null,null,null,null,null,null,null,null,2]
[4,null,null,null,null,null,null,null,null,null,null,null,4]
[null,null,null,null,null,null,null,"gewonnen",null,null,null,null,null,null,null,null,null,null,null,"gewonnen"]
[null,null,null,null,null,null,null,"verloren",null,null,null,null,null,null,null,null,null,null,null,"verloren"]
[]
[null,"Schreiber:",null,null,null,null,"Kontrolle:",null,null,null,null,null,null,"Schreiber:",null,null,null,null,"Kontrolle:"]
[]
[]
[]
[{"$f":"Select!$C$12","v":"ÖM Indoor 2019"},null,null,null,null,null,null,null,null,null,null,null,"Mannschaft:",null,null,{"$f":"MC16_Baum!$C$15","v":"CM_5"}]
["Veranstaltung"]
[{"$f":"Select!$C$13","v":"09.-10. Februar 2019"},null,null,null,null,null,null,null,null,null,null,null,"Schützen:",null,null,{"$f":"MC16_Baum!$C$16","v":"Schütze1_CM5 Schütze2_CM5"}]
["Datum"]
["Bewerb:",null,{"$f":"Select!$C$14","v":"Mannschaftsbewerb"},null,null,null,null,null,null,null,null,null,"Bogenklasse:",null,null,{"$f":"Select!$C$20","v":"Compound Damen"}]
[]
[]
[]
["1/8 Elimination",null,null,null,null,{"$f":"MC16_Baum!$C$59","v":"Scheibe: 55"},null,null,null,null,null,null,"1/4 Finale",null,null,null,null,{"$f":"MC16_Baum!$G$57","v":"Scheibe: 43"}]
[null,1,2,"Summe","Gesamt",null,null,null,null,null,null,null,null,1,2,"Summe","Gesamt"]
[1,null,null,null,null,null,null,null,null,null,null,null,1]
[]
[2,null,null,null,null,null,null,null,null,null,null,null,2]
[null,null,null,null,null,null,"Stechen (wenn erf.)",null,null,null,null,null,null,null,null,null,null,null,"Stechen (wenn erf.)"]
[3,null,null,null,null,null,1,null,null,null,null,null,3,null,null,null,null,null,1]
[null,null,null,null,null,null,2,null,null,null,null,null,null,null,null,null,null,null,2]
[4,null,null,null,null,null,null,null,null,null,null,null,4]
[null,null,null,null,null,null,null,"gewonnen",null,null,null,null,null,null,null,null,null,null,null,"gewonnen"]
[null,null,null,null,null,null,null,"verloren",null,null,null,null,null,null,null,null,null,null,null,"verloren"]
[]
[null,"Schreiber:",null,null,null,null,"Kontrolle:",null,null,null,null,null,null,"Schreiber:",null,null,null,null,"Kontrolle:"]
[]
[]
[]
["1/2 Finale",null,null,null,null,{"$f":"MC16_Baum!$K$56","v":"Scheibe: 32"},null,null,null,null,null,null,"1./2. od. 3./4. Platz",null,null,null,null,"Scheibe:"]
[null,1,2,"Summe","Gesamt",null,null,null,null,null,null,null,null,1,2,"Summe","Gesamt"]
[1,null,null,null,null,null,null,null,null,null,null,null,1]
[]
[2,null,null,null,null,null,null,null,null,null,null,null,2]
[null,null,null,null,null,null,"Stechen (wenn erf.)",null,null,null,null,null,null,null,null,null,null,null,"Stechen (wenn erf.)"]
[3,null,null,null,null,null,1,null,null,null,null,null,3,null,null,null,null,null,1]
[null,null,null,null,null,null,2,null,null,null,null,null,null,null,null,null,null,null,2]
[4,null,null,null,null,null,null,null,null,null,null,null,4]
[null,null,null,null,null,null,null,"gewonnen",null,null,null,null,null,null,null,null,null,null,null,"gewonnen"]
[null,null,null,null,null,null,null,"verloren",null,null,null,null,null,null,null,null,null,null,null,"verloren"]
[]
[null,"Schreiber:",null,null,null,null,"Kontrolle:",null,null,null,null,null,null,"Schreiber:",null,null,null,null,"Kontrolle:"]
[]
[]
[]
[{"$f":"Select!$C$12","v":"ÖM Indoor 2019"},null,null,null,null,null,null,null,null,null,null,null,"Mannschaft:",null,null,{"$f":"MC16_Baum!$C$17","v":"CM_12"}]
["Veranstaltung"]
[{"$f":"Select!$C$13","v":"09.-10. Februar 2019"},null,null,null,null,null,null,null,null,null,null,null,"Schützen:",null,null,{"$f":"MC16_Baum!$C$18","v":"Schütze1_CM12  Schütze2_CM12"}]
["Datum"]
["Bewerb:",null,{"$f":"Select!$C$14","v":"Mannschaftsbewerb"},null,null,null,null,null,null,null,null,null,"Bogenklasse:",null,null,{"$f":"Select!$C$20","v":"Compound Damen"}]
[]
[]
[]
["1/8 Elimination",null,null,null,null,{"$f":"MC16_Baum!$C$60","v":"Scheibe: 56"},null,null,null,null,null,null,"1/4 Finale",null,null,null,null,{"$f":"MC16_Baum!$G$57","v":"Scheibe: 43"}]
[null,1,2,"Summe","Gesamt",null,null,null,null,null,null,null,null,1,2,"Summe","Gesamt"]
[1,null,null,null,null,null,null,null,null,null,null,null,1]
[]
[2,null,null,null,null,null,null,null,null,null,null,null,2]
[null,null,null,null,null,null,"Stechen (wenn erf.)",null,null,null,null,null,null,null,null,null,null,null,"Stechen (wenn erf.)"]
[3,null,null,null,null,null,1,null,null,null,null,null,3,null,null,null,null,null,1]
[null,null,null,null,null,null,2,null,null,null,null,null,null,null,null,null,null,null,2]
[4,null,null,null,null,null,null,null,null,null,null,null,4]
[null,null,null,null,null,null,null,"gewonnen",null,null,null,null,null,null,null,null,null,null,null,"gewonnen"]
[null,null,null,null,null,null,null,"verloren",null,null,null,null,null,null,null,null,null,null,null,"verloren"]
[]
[null,"Schreiber:",null,null,null,null,"Kontrolle:",null,null,null,null,null,null,"Schreiber:",null,null,null,null,"Kontrolle:"]
[]
[]
[]
["1/2 Finale",null,null,null,null,{"$f":"MC16_Baum!$K$56","v":"Scheibe: 32"},null,null,null,null,null,null,"1./2. od. 3./4. Platz",null,null,null,null,"Scheibe:"]
[null,1,2,"Summe","Gesamt",null,null,null,null,null,null,null,null,1,2,"Summe","Gesamt"]
[1,null,null,null,null,null,null,null,null,null,null,null,1]
[]
[2,null,null,null,null,null,null,null,null,null,null,null,2]
[null,null,null,null,null,null,"Stechen (wenn erf.)",null,null,null,null,null,null,null,null,null,null,null,"Stechen (wenn erf.)"]
[3,null,null,null,null,null,1,null,null,null,null,null,3,null,null,null,null,null,1]
[null,null,null,null,null,null,2,null,null,null,null,null,null,null,null,null,null,null,2]
[4,null,null,null,null,null,null,null,null,null,null,null,4]
[null,null,null,null,null,null,null,"gewonnen",null,null,null,null,null,null,null,null,null,null,null,"gewonnen"]
[null,null,null,null,null,null,null,"verloren",null,null,null,null,null,null,null,null,null,null,null,"verloren"]
[]
[null,"Schreiber:",null,null,null,null,"Kontrolle:",null,null,null,null,null,null,"Schreiber:",null,null,null,null,"Kontrolle:"]
[]
[]
[]
[{"$f":"Select!$C$12","v":"ÖM Indoor 2019"},null,null,null,null,null,null,null,null,null,null,null,"Mannschaft:",null,null,{"$f":"MC16_Baum!$C$21","v":"CM_13"}]
["Veranstaltung"]
[{"$f":"Select!$C$13","v":"09.-10. Februar 2019"},null,null,null,null,null,null,null,null,null,null,null,"Schützen:",null,null,{"$f":"MC16_Baum!$C$22","v":"Schütze1_CM13  Schütze2_CM13 "}]
["Datum"]
["Bewerb:",null,{"$f":"Select!$C$14","v":"Mannschaftsbewerb"},null,null,null,null,null,null,null,null,null,"Bogenklasse:",null,null,{"$f":"Select!$C$20","v":"Compound Damen"}]
[]
[]
[]
["1/8 Elimination",null,null,null,null,{"$f":"MC16_Baum!$C$61","v":"Scheibe: 57"},null,null,null,null,null,null,"1/4 Finale",null,null,null,null,{"$f":"MC16_Baum!$G$58","v":"Scheibe: 44"}]
[null,1,2,"Summe","Gesamt",null,null,null,null,null,null,null,null,1,2,"Summe","Gesamt"]
[1,null,null,null,null,null,null,null,null,null,null,null,1]
[]
[2,null,null,null,null,null,null,null,null,null,null,null,2]
[null,null,null,null,null,null,"Stechen (wenn erf.)",null,null,null,null,null,null,null,null,null,null,null,"Stechen (wenn erf.)"]
[3,null,null,null,null,null,1,null,null,null,null,null,3,null,null,null,null,null,1]
[null,null,null,null,null,null,2,null,null,null,null,null,null,null,null,null,null,null,2]
[4,null,null,null,null,null,null,null,null,null,null,null,4]
[null,null,null,null,null,null,null,"gewonnen",null,null,null,null,null,null,null,null,null,null,null,"gewonnen"]
[null,null,null,null,null,null,null,"verloren",null,null,null,null,null,null,null,null,null,null,null,"verloren"]
[]
[null,"Schreiber:",null,null,null,null,"Kontrolle:",null,null,null,null,null,null,"Schreiber:",null,null,null,null,"Kontrolle:"]
[]
[]
[]
["1/2 Finale",null,null,null,null,{"$f":"MC16_Baum!$K$56","v":"Scheibe: 32"},null,null,null,null,null,null,"1./2. od. 3./4. Platz",null,null,null,null,"Scheibe:"]
[null,1,2,"Summe","Gesamt",null,null,null,null,null,null,null,null,1,2,"Summe","Gesamt"]
[1,null,null,null,null,null,null,null,null,null,null,null,1]
[]
[2,null,null,null,null,null,null,null,null,null,null,null,2]
[null,null,null,null,null,null,"Stechen (wenn erf.)",null,null,null,null,null,null,null,null,null,null,null,"Stechen (wenn erf.)"]
[3,null,null,null,null,null,1,null,null,null,null,null,3,null,null,null,null,null,1]
[null,null,null,null,null,null,2,null,null,null,null,null,null,null,null,null,null,null,2]
[4,null,null,null,null,null,null,null,null,null,null,null,4]
[null,null,null,null,null,null,null,"gewonnen",null,null,null,null,null,null,null,null,null,null,null,"gewonnen"]
[null,null,null,null,null,null,null,"verloren",null,null,null,null,null,null,null,null,null,null,null,"verloren"]
[]
[null,"Schreiber:",null,null,null,null,"Kontrolle:",null,null,null,null,null,null,"Schreiber:",null,null,null,null,"Kontrolle:"]
[]
[]
[]
[{"$f":"Select!$C$12","v":"ÖM Indoor 2019"},null,null,null,null,null,null,null,null,null,null,null,"Mannschaft:",null,null,{"$f":"MC16_Baum!$C$23","v":"CM_4"}]
["Veranstaltung"]
[{"$f":"Select!$C$13","v":"09.-10. Februar 2019"},null,null,null,null,null,null,null,null,null,null,null,"Schützen:",null,null,{"$f":"MC16_Baum!$C$24","v":"Schütze1_CM4 Schütze2_CM4"}]
["Datum"]
["Bewerb:",null,{"$f":"Select!$C$14","v":"Mannschaftsbewerb"},null,null,null,null,null,null,null,null,null,"Bogenklasse:",null,null,{"$f":"Select!$C$20","v":"Compound Damen"}]
[]
[]
[]
["1/8 Elimination",null,null,null,null,{"$f":"MC16_Baum!$C$62","v":"Scheibe: 58"},null,null,null,null,null,null,"1/4 Finale",null,null,null,null,{"$f":"MC16_Baum!$G$58","v":"Scheibe: 44"}]
[null,1,2,"Summe","Gesamt",null,null,null,null,null,null,null,null,1,2,"Summe","Gesamt"]
[1,null,null,null,null,null,null,null,null,null,null,null,1]
[]
[2,null,null,null,null,null,null,null,null,null,null,null,2]
[null,null,null,null,null,null,"Stechen (wenn erf.)",null,null,null,null,null,null,null,null,null,null,null,"Stechen (wenn erf.)"]
[3,null,null,null,null,null,1,null,null,null,null,null,3,null,null,null,null,null,1]
[null,null,null,null,null,null,2,null,null,null,null,null,null,null,null,null,null,null,2]
[4,null,null,null,null,null,null,null,null,null,null,null,4]
[null,null,null,null,null,null,null,"gewonnen",null,null,null,null,null,null,null,null,null,null,null,"gewonnen"]
[null,null,null,null,null,null,null,"verloren",null,null,null,null,null,null,null,null,null,null,null,"verloren"]
[]
[null,"Schreiber:",null,null,null,null,"Kontrolle:",null,null,null,null,null,null,"Schreiber:",null,null,null,null,"Kontrolle:"]
[]
[]
[]
["1/2 Finale",null,null,null,null,{"$f":"MC16_Baum!$K$56","v":"Scheibe: 32"},null,null,null,null,null,null,"1./2. od. 3./4. Platz",null,null,null,null,"Scheibe:"]
[null,1,2,"Summe","Gesamt",null,null,null,null,null,null,null,null,1,2,"Summe","Gesamt"]
[1,null,null,null,null,null,null,null,null,null,null,null,1]
[]
[2,null,null,null,null,null,null,null,null,null,null,null,2]
[null,null,null,null,null,null,"Stechen (wenn erf.)",null,null,null,null,null,null,null,null,null,null,null,"Stechen (wenn erf.)"]
[3,null,null,null,null,null,1,null,null,null,null,null,3,null,null,null,null,null,1]
[null,null,null,null,null,null,2,null,null,null,null,null,null,null,null,null,null,null,2]
[4,null,null,null,null,null,null,null,null,null,null,null,4]
[null,null,null,null,null,null,null,"gewonnen",null,null,null,null,null,null,null,null,null,null,null,"gewonnen"]
[null,null,null,null,null,null,null,"verloren",null,null,null,null,null,null,null,null,null,null,null,"verloren"]
[]
[null,"Schreiber:",null,null,null,null,"Kontrolle:",null,null,null,null,null,null,"Schreiber:",null,null,null,null,"Kontrolle:"]
[]
[]
[]
[{"$f":"Select!$C$12","v":"ÖM Indoor 2019"},null,null,null,null,null,null,null,null,null,null,null,"Mannschaft:",null,null,{"$f":"MC16_Baum!$C$27","v":"CM_3"}]
["Veranstaltung"]
[{"$f":"Select!$C$13","v":"09.-10. Februar 2019"},null,null,null,null,null,null,null,null,null,null,null,"Schützen:",null,null,{"$f":"MC16_Baum!$C$28","v":"Schütze1_CM3 Schütze2_CM3"}]
["Datum"]
["Bewerb:",null,{"$f":"Select!$C$14","v":"Mannschaftsbewerb"},null,null,null,null,null,null,null,null,null,"Bogenklasse:",null,null,{"$f":"Select!$C$20","v":"Compound Damen"}]
[]
[]
[]
["1/8 Elimination",null,null,null,null,{"$f":"MC16_Baum!$C$63","v":"Scheibe: 59"},null,null,null,null,null,null,"1/4 Finale",null,null,null,null,{"$f":"MC16_Baum!$G$59","v":"Scheibe: 45"}]
[null,1,2,"Summe","Gesamt",null,null,null,null,null,null,null,null,1,2,"Summe","Gesamt"]
[1,null,null,null,null,null,null,null,null,null,null,null,1]
[]
[2,null,null,null,null,null,null,null,null,null,null,null,2]
[null,null,null,null,null,null,"Stechen (wenn erf.)",null,null,null,null,null,null,null,null,null,null,null,"Stechen (wenn erf.)"]
[3,null,null,null,null,null,1,null,null,null,null,null,3,null,null,null,null,null,1]
[null,null,null,null,null,null,2,null,null,null,null,null,null,null,null,null,null,null,2]
[4,null,null,null,null,null,null,null,null,null,null,null,4]
[null,null,null,null,null,null,null,"gewonnen",null,null,null,null,null,null,null,null,null,null,null,"gewonnen"]
[null,null,null,null,null,null,null,"verloren",null,null,null,null,null,null,null,null,null,null,null,"verloren"]
[]
[null,"Schreiber:",null,null,null,null,"Kontrolle:",null,null,null,null,null,null,"Schreiber:",null,null,null,null,"Kontrolle:"]
[]
[]
[]
["1/2 Finale",null,null,null,null,{"$f":"MC16_Baum!$K$57","v":"Scheibe: 33"},null,null,null,null,null,null,"1./2. od. 3./4. Platz",null,null,null,null,"Scheibe:"]
[null,1,2,"Summe","Gesamt",null,null,null,null,null,null,null,null,1,2,"Summe","Gesamt"]
[1,null,null,null,null,null,null,null,null,null,null,null,1]
[]
[2,null,null,null,null,null,null,null,null,null,null,null,2]
[null,null,null,null,null,null,"Stechen (wenn erf.)",null,null,null,null,null,null,null,null,null,null,null,"Stechen (wenn erf.)"]
[3,null,null,null,null,null,1,null,null,null,null,null,3,null,null,null,null,null,1]
[null,null,null,null,null,null,2,null,null,null,null,null,null,null,null,null,null,null,2]
[4,null,null,null,null,null,null,null,null,null,null,null,4]
[null,null,null,null,null,null,null,"gewonnen",null,null,null,null,null,null,null,null,null,null,null,"gewonnen"]
[null,null,null,null,null,null,null,"verloren",null,null,null,null,null,null,null,null,null,null,null,"verloren"]
[]
[null,"Schreiber:",null,null,null,null,"Kontrolle:",null,null,null,null,null,null,"Schreiber:",null,null,null,null,"Kontrolle:"]
[]
[]
[]
[{"$f":"Select!$C$12","v":"ÖM Indoor 2019"},null,null,null,null,null,null,null,null,null,null,null,"Mannschaft:",null,null,{"$f":"MC16_Baum!$C$29","v":"CM_14"}]
["Veranstaltung"]
[{"$f":"Select!$C$13","v":"09.-10. Februar 2019"},null,null,null,null,null,null,null,null,null,null,null,"Schützen:",null,null,{"$f":"MC16_Baum!$C$30","v":"Schütze1_CM14 Schütze2_CM14 "}]
["Datum"]
["Bewerb:",null,{"$f":"Select!$C$14","v":"Mannschaftsbewerb"},null,null,null,null,null,null,null,null,null,"Bogenklasse:",null,null,{"$f":"Select!$C$20","v":"Compound Damen"}]
[]
[]
[]
["1/8 Elimination",null,null,null,null,{"$f":"MC16_Baum!$C$64","v":"Scheibe: 60"},null,null,null,null,null,null,"1/4 Finale",null,null,null,null,{"$f":"MC16_Baum!$G$59","v":"Scheibe: 45"}]
[null,1,2,"Summe","Gesamt",null,null,null,null,null,null,null,null,1,2,"Summe","Gesamt"]
[1,null,null,null,null,null,null,null,null,null,null,null,1]
[]
[2,null,null,null,null,null,null,null,null,null,null,null,2]
[null,null,null,null,null,null,"Stechen (wenn erf.)",null,null,null,null,null,null,null,null,null,null,null,"Stechen (wenn erf.)"]
[3,null,null,null,null,null,1,null,null,null,null,null,3,null,null,null,null,null,1]
[null,null,null,null,null,null,2,null,null,null,null,null,null,null,null,null,null,null,2]
[4,null,null,null,null,null,null,null,null,null,null,null,4]
[null,null,null,null,null,null,null,"gewonnen",null,null,null,null,null,null,null,null,null,null,null,"gewonnen"]
[null,null,null,null,null,null,null,"verloren",null,null,null,null,null,null,null,null,null,null,null,"verloren"]
[]
[null,"Schreiber:",null,null,null,null,"Kontrolle:",null,null,null,null,null,null,"Schreiber:",null,null,null,null,"Kontrolle:"]
[]
[]
[]
["1/2 Finale",null,null,null,null,{"$f":"MC16_Baum!$K$57","v":"Scheibe: 33"},null,null,null,null,null,null,"1./2. od. 3./4. Platz",null,null,null,null,"Scheibe:"]
[null,1,2,"Summe","Gesamt",null,null,null,null,null,null,null,null,1,2,"Summe","Gesamt"]
[1,null,null,null,null,null,null,null,null,null,null,null,1]
[]
[2,null,null,null,null,null,null,null,null,null,null,null,2]
[null,null,null,null,null,null,"Stechen (wenn erf.)",null,null,null,null,null,null,null,null,null,null,null,"Stechen (wenn erf.)"]
[3,null,null,null,null,null,1,null,null,null,null,null,3,null,null,null,null,null,1]
[null,null,null,null,null,null,2,null,null,null,null,null,null,null,null,null,null,null,2]
[4,null,null,null,null,null,null,null,null,null,null,null,4]
[null,null,null,null,null,null,null,"gewonnen",null,null,null,null,null,null,null,null,null,null,null,"gewonnen"]
[null,null,null,null,null,null,null,"verloren",null,null,null,null,null,null,null,null,null,null,null,"verloren"]
[]
[null,"Schreiber:",null,null,null,null,"Kontrolle:",null,null,null,null,null,null,"Schreiber:",null,null,null,null,"Kontrolle:"]
[]
[]
[]
[{"$f":"Select!$C$12","v":"ÖM Indoor 2019"},null,null,null,null,null,null,null,null,null,null,null,"Mannschaft:",null,null,{"$f":"MC16_Baum!$C$33","v":"CM_11"}]
["Veranstaltung"]
[{"$f":"Select!$C$13","v":"09.-10. Februar 2019"},null,null,null,null,null,null,null,null,null,null,null,"Schützen:",null,null,{"$f":"MC16_Baum!$C$34","v":"Schütze1_CM11 Schütze2_CM11"}]
["Datum"]
["Bewerb:",null,{"$f":"Select!$C$14","v":"Mannschaftsbewerb"},null,null,null,null,null,null,null,null,null,"Bogenklasse:",null,null,{"$f":"Select!$C$20","v":"Compound Damen"}]
[]
[]
[]
["1/8 Elimination",null,null,null,null,{"$f":"MC16_Baum!$C$65","v":"Scheibe: 61"},null,null,null,null,null,null,"1/4 Finale",null,null,null,null,{"$f":"MC16_Baum!$G$60","v":"Scheibe: 46"}]
[null,1,2,"Summe","Gesamt",null,null,null,null,null,null,null,null,1,2,"Summe","Gesamt"]
[1,null,null,null,null,null,null,null,null,null,null,null,1]
[]
[2,null,null,null,null,null,null,null,null,null,null,null,2]
[null,null,null,null,null,null,"Stechen (wenn erf.)",null,null,null,null,null,null,null,null,null,null,null,"Stechen (wenn erf.)"]
[3,null,null,null,null,null,1,null,null,null,null,null,3,null,null,null,null,null,1]
[null,null,null,null,null,null,2,null,null,null,null,null,null,null,null,null,null,null,2]
[4,null,null,null,null,null,null,null,null,null,null,null,4]
[null,null,null,null,null,null,null,"gewonnen",null,null,null,null,null,null,null,null,null,null,null,"gewonnen"]
[null,null,null,null,null,null,null,"verloren",null,null,null,null,null,null,null,null,null,null,null,"verloren"]
[]
[null,"Schreiber:",null,null,null,null,"Kontrolle:",null,null,null,null,null,null,"Schreiber:",null,null,null,null,"Kontrolle:"]
[]
[]
[]
["1/2 Finale",null,null,null,null,{"$f":"MC16_Baum!$K$57","v":"Scheibe: 33"},null,null,null,null,null,null,"1./2. od. 3./4. Platz",null,null,null,null,"Scheibe:"]
[null,1,2,"Summe","Gesamt",null,null,null,null,null,null,null,null,1,2,"Summe","Gesamt"]
[1,null,null,null,null,null,null,null,null,null,null,null,1]
[]
[2,null,null,null,null,null,null,null,null,null,null,null,2]
[null,null,null,null,null,null,"Stechen (wenn erf.)",null,null,null,null,null,null,null,null,null,null,null,"Stechen (wenn erf.)"]
[3,null,null,null,null,null,1,null,null,null,null,null,3,null,null,null,null,null,1]
[null,null,null,null,null,null,2,null,null,null,null,null,null,null,null,null,null,null,2]
[4,null,null,null,null,null,null,null,null,null,null,null,4]
[null,null,null,null,null,null,null,"gewonnen",null,null,null,null,null,null,null,null,null,null,null,"gewonnen"]
[null,null,null,null,null,null,null,"verloren",null,null,null,null,null,null,null,null,null,null,null,"verloren"]
[]
[null,"Schreiber:",null,null,null,null,"Kontrolle:",null,null,null,null,null,null,"Schreiber:",null,null,null,null,"Kontrolle:"]
[]
[]
[]
[{"$f":"Select!$C$12","v":"ÖM Indoor 2019"},null,null,null,null,null,null,null,null,null,null,null,"Mannschaft:",null,null,{"$f":"MC16_Baum!$C$35","v":"CM_6"}]
["Veranstaltung"]
[{"$f":"Select!$C$13","v":"09.-10. Februar 2019"},null,null,null,null,null,null,null,null,null,null,null,"Schützen:",null,null,{"$f":"MC16_Baum!$C$36","v":"Schütze1_CM6 Schütze2_CM6"}]
["Datum"]
["Bewerb:",null,{"$f":"Select!$C$14","v":"Mannschaftsbewerb"},null,null,null,null,null,null,null,null,null,"Bogenklasse:",null,null,{"$f":"Select!$C$20","v":"Compound Damen"}]
[]
[]
[]
["1/8 Elimination",null,null,null,null,{"$f":"MC16_Baum!$C$66","v":"Scheibe: 62"},null,null,null,null,null,null,"1/4 Finale",null,null,null,null,{"$f":"MC16_Baum!$G$60","v":"Scheibe: 46"}]
[null,1,2,"Summe","Gesamt",null,null,null,null,null,null,null,null,1,2,"Summe","Gesamt"]
[1,null,null,null,null,null,null,null,null,null,null,null,1]
[]
[2,null,null,null,null,null,null,null,null,null,null,null,2]
[null,null,null,null,null,null,"Stechen (wenn erf.)",null,null,null,null,null,null,null,null,null,null,null,"Stechen (wenn erf.)"]
[3,null,null,null,null,null,1,null,null,null,null,null,3,null,null,null,null,null,1]
[null,null,null,null,null,null,2,null,null,null,null,null,null,null,null,null,null,null,2]
[4,null,null,null,null,null,null,null,null,null,null,null,4]
[null,null,null,null,null,null,null,"gewonnen",null,null,null,null,null,null,null,null,null,null,null,"gewonnen"]
[null,null,null,null,null,null,null,"verloren",null,null,null,null,null,null,null,null,null,null,null,"verloren"]
[]
[null,"Schreiber:",null,null,null,null,"Kontrolle:",null,null,null,null,null,null,"Schreiber:",null,null,null,null,"Kontrolle:"]
[]
[]
[]
["1/2 Finale",null,null,null,null,{"$f":"MC16_Baum!$K$57","v":"Scheibe: 33"},null,null,null,null,null,null,"1./2. od. 3./4. Platz",null,null,null,null,"Scheibe:"]
[null,1,2,"Summe","Gesamt",null,null,null,null,null,null,null,null,1,2,"Summe","Gesamt"]
[1,null,null,null,null,null,null,null,null,null,null,null,1]
[]
[2,null,null,null,null,null,null,null,null,null,null,null,2]
[null,null,null,null,null,null,"Stechen (wenn erf.)",null,null,null,null,null,null,null,null,null,null,null,"Stechen (wenn erf.)"]
[3,null,null,null,null,null,1,null,null,null,null,null,3,null,null,null,null,null,1]
[null,null,null,null,null,null,2,null,null,null,null,null,null,null,null,null,null,null,2]
[4,null,null,null,null,null,null,null,null,null,null,null,4]
[null,null,null,null,null,null,null,"gewonnen",null,null,null,null,null,null,null,null,null,null,null,"gewonnen"]
[null,null,null,null,null,null,null,"verloren",null,null,null,null,null,null,null,null,null,null,null,"verloren"]
[]
[null,"Schreiber:",null,null,null,null,"Kontrolle:",null,null,null,null,null,null,"Schreiber:",null,null,null,null,"Kontrolle:"]
[]
[]
[]
[{"$f":"Select!$C$12","v":"ÖM Indoor 2019"},null,null,null,null,null,null,null,null,null,null,null,"Mannschaft:",null,null,{"$f":"MC16_Baum!$C$39","v":"CM_7"}]
["Veranstaltung"]
[{"$f":"Select!$C$13","v":"09.-10. Februar 2019"},null,null,null,null,null,null,null,null,null,null,null,"Schützen:",null,null,{"$f":"MC16_Baum!$C$40","v":"Schütze1_CM7 Schütze2_CM7"}]
["Datum"]
["Bewerb:",null,{"$f":"Select!$C$14","v":"Mannschaftsbewerb"},null,null,null,null,null,null,null,null,null,"Bogenklasse:",null,null,{"$f":"Select!$C$20","v":"Compound Damen"}]
[]
[]
[]
["1/8 Elimination",null,null,null,null,{"$f":"MC16_Baum!$C$67","v":"Scheibe: 63"},null,null,null,null,null,null,"1/4 Finale",null,null,null,null,{"$f":"MC16_Baum!$G$61","v":"Scheibe: 47"}]
[null,1,2,"Summe","Gesamt",null,null,null,null,null,null,null,null,1,2,"Summe","Gesamt"]
[1,null,null,null,null,null,null,null,null,null,null,null,1]
[]
[2,null,null,null,null,null,null,null,null,null,null,null,2]
[null,null,null,null,null,null,"Stechen (wenn erf.)",null,null,null,null,null,null,null,null,null,null,null,"Stechen (wenn erf.)"]
[3,null,null,null,null,null,1,null,null,null,null,null,3,null,null,null,null,null,1]
[null,null,null,null,null,null,2,null,null,null,null,null,null,null,null,null,null,null,2]
[4,null,null,null,null,null,null,null,null,null,null,null,4]
[null,null,null,null,null,null,null,"gewonnen",null,null,null,null,null,null,null,null,null,null,null,"gewonnen"]
[null,null,null,null,null,null,null,"verloren",null,null,null,null,null,null,null,null,null,null,null,"verloren"]
[]
[null,"Schreiber:",null,null,null,null,"Kontrolle:",null,null,null,null,null,null,"Schreiber:",null,null,null,null,"Kontrolle:"]
[]
[]
[]
["1/2 Finale",null,null,null,null,{"$f":"MC16_Baum!$K$58","v":"Scheibe: 34"},null,null,null,null,null,null,"1./2. od. 3./4. Platz",null,null,null,null,"Scheibe:"]
[null,1,2,"Summe","Gesamt",null,null,null,null,null,null,null,null,1,2,"Summe","Gesamt"]
[1,null,null,null,null,null,null,null,null,null,null,null,1]
[]
[2,null,null,null,null,null,null,null,null,null,null,null,2]
[null,null,null,null,null,null,"Stechen (wenn erf.)",null,null,null,null,null,null,null,null,null,null,null,"Stechen (wenn erf.)"]
[3,null,null,null,null,null,1,null,null,null,null,null,3,null,null,null,null,null,1]
[null,null,null,null,null,null,2,null,null,null,null,null,null,null,null,null,null,null,2]
[4,null,null,null,null,null,null,null,null,null,null,null,4]
[null,null,null,null,null,null,null,"gewonnen",null,null,null,null,null,null,null,null,null,null,null,"gewonnen"]
[null,null,null,null,null,null,null,"verloren",null,null,null,null,null,null,null,null,null,null,null,"verloren"]
[]
[null,"Schreiber:",null,null,null,null,"Kontrolle:",null,null,null,null,null,null,"Schreiber:",null,null,null,null,"Kontrolle:"]
[]
[]
[]
[{"$f":"Select!$C$12","v":"ÖM Indoor 2019"},null,null,null,null,null,null,null,null,null,null,null,"Mannschaft:",null,null,{"$f":"MC16_Baum!$C$41","v":"CM_10"}]
["Veranstaltung"]
[{"$f":"Select!$C$13","v":"09.-10. Februar 2019"},null,null,null,null,null,null,null,null,null,null,null,"Schützen:",null,null,{"$f":"MC16_Baum!$C$42","v":"Schütze1_CM10 Schütze2_CM10"}]
["Datum"]
["Bewerb:",null,{"$f":"Select!$C$14","v":"Mannschaftsbewerb"},null,null,null,null,null,null,null,null,null,"Bogenklasse:",null,null,{"$f":"Select!$C$20","v":"Compound Damen"}]
[]
[]
[]
["1/8 Elimination",null,null,null,null,{"$f":"MC16_Baum!$C$68","v":"Scheibe: 64"},null,null,null,null,null,null,"1/4 Finale",null,null,null,null,{"$f":"MC16_Baum!$G$61","v":"Scheibe: 47"}]
[null,1,2,"Summe","Gesamt",null,null,null,null,null,null,null,null,1,2,"Summe","Gesamt"]
[1,null,null,null,null,null,null,null,null,null,null,null,1]
[]
[2,null,null,null,null,null,null,null,null,null,null,null,2]
[null,null,null,null,null,null,"Stechen (wenn erf.)",null,null,null,null,null,null,null,null,null,null,null,"Stechen (wenn erf.)"]
[3,null,null,null,null,null,1,null,null,null,null,null,3,null,null,null,null,null,1]
[null,null,null,null,null,null,2,null,null,null,null,null,null,null,null,null,null,null,2]
[4,null,null,null,null,null,null,null,null,null,null,null,4]
[null,null,null,null,null,null,null,"gewonnen",null,null,null,null,null,null,null,null,null,null,null,"gewonnen"]
[null,null,null,null,null,null,null,"verloren",null,null,null,null,null,null,null,null,null,null,null,"verloren"]
[]
[null,"Schreiber:",null,null,null,null,"Kontrolle:",null,null,null,null,null,null,"Schreiber:",null,null,null,null,"Kontrolle:"]
[]
[]
[]
["1/2 Finale",null,null,null,null,{"$f":"MC16_Baum!$K$58","v":"Scheibe: 34"},null,null,null,null,null,null,"1./2. od. 3./4. Platz",null,null,null,null,"Scheibe:"]
[null,1,2,"Summe","Gesamt",null,null,null,null,null,null,null,null,1,2,"Summe","Gesamt"]
[1,null,null,null,null,null,null,null,null,null,null,null,1]
[]
[2,null,null,null,null,null,null,null,null,null,null,null,2]
[null,null,null,null,null,null,"Stechen (wenn erf.)",null,null,null,null,null,null,null,null,null,null,null,"Stechen (wenn erf.)"]
[3,null,null,null,null,null,1,null,null,null,null,null,3,null,null,null,null,null,1]
[null,null,null,null,null,null,2,null,null,null,null,null,null,null,null,null,null,null,2]
[4,null,null,null,null,null,null,null,null,null,null,null,4]
[null,null,null,null,null,null,null,"gewonnen",null,null,null,null,null,null,null,null,null,null,null,"gewonnen"]
[null,null,null,null,null,null,null,"verloren",null,null,null,null,null,null,null,null,null,null,null,"verloren"]
[]
[null,"Schreiber:",null,null,null,null,"Kontrolle:",null,null,null,null,null,null,"Schreiber:",null,null,null,null,"Kontrolle:"]
[]
[]
[]
[{"$f":"Select!$C$12","v":"ÖM Indoor 2019"},null,null,null,null,null,null,null,null,null,null,null,"Mannschaft:",null,null,{"$f":"MC16_Baum!$C$45","v":"CM_15"}]
["Veranstaltung"]
[{"$f":"Select!$C$13","v":"09.-10. Februar 2019"},null,null,null,null,null,null,null,null,null,null,null,"Schützen:",null,null,{"$f":"MC16_Baum!$C$46","v":"Schütze1_CM15 Schütze2_CM15"}]
["Datum"]
["Bewerb:",null,{"$f":"Select!$C$14","v":"Mannschaftsbewerb"},null,null,null,null,null,null,null,null,null,"Bogenklasse:",null,null,{"$f":"Select!$C$20","v":"Compound Damen"}]
[]
[]
[]
["1/8 Elimination",null,null,null,null,{"$f":"MC16_Baum!$C$69","v":"Scheibe: 65"},null,null,null,null,null,null,"1/4 Finale",null,null,null,null,{"$f":"MC16_Baum!$G$62","v":"Scheibe: 48"}]
[null,1,2,"Summe","Gesamt",null,null,null,null,null,null,null,null,1,2,"Summe","Gesamt"]
[1,null,null,null,null,null,null,null,null,null,null,null,1]
[]
[2,null,null,null,null,null,null,null,null,null,null,null,2]
[null,null,null,null,null,null,"Stechen (wenn erf.)",null,null,null,null,null,null,null,null,null,null,null,"Stechen (wenn erf.)"]
[3,null,null,null,null,null,1,null,null,null,null,null,3,null,null,null,null,null,1]
[null,null,null,null,null,null,2,null,null,null,null,null,null,null,null,null,null,null,2]
[4,null,null,null,null,null,null,null,null,null,null,null,4]
[null,null,null,null,null,null,null,"gewonnen",null,null,null,null,null,null,null,null,null,null,null,"gewonnen"]
[null,null,null,null,null,null,null,"verloren",null,null,null,null,null,null,null,null,null,null,null,"verloren"]
[]
[null,"Schreiber:",null,null,null,null,"Kontrolle:",null,null,null,null,null,null,"Schreiber:",null,null,null,null,"Kontrolle:"]
[]
[]
[]
["1/2 Finale",null,null,null,null,{"$f":"MC16_Baum!$K$58","v":"Scheibe: 34"},null,null,null,null,null,null,"1./2. od. 3./4. Platz",null,null,null,null,"Scheibe:"]
[null,1,2,"Summe","Gesamt",null,null,null,null,null,null,null,null,1,2,"Summe","Gesamt"]
[1,null,null,null,null,null,null,null,null,null,null,null,1]
[]
[2,null,null,null,null,null,null,null,null,null,null,null,2]
[null,null,null,null,null,null,"Stechen (wenn erf.)",null,null,null,null,null,null,null,null,null,null,null,"Stechen (wenn erf.)"]
[3,null,null,null,null,null,1,null,null,null,null,null,3,null,null,null,null,null,1]
[null,null,null,null,null,null,2,null,null,null,null,null,null,null,null,null,null,null,2]
[4,null,null,null,null,null,null,null,null,null,null,null,4]
[null,null,null,null,null,null,null,"gewonnen",null,null,null,null,null,null,null,null,null,null,null,"gewonnen"]
[null,null,null,null,null,null,null,"verloren",null,null,null,null,null,null,null,null,null,null,null,"verloren"]
[]
[null,"Schreiber:",null,null,null,null,"Kontrolle:",null,null,null,null,null,null,"Schreiber:",null,null,null,null,"Kontrolle:"]
[]
[]
[]
[{"$f":"Select!$C$12","v":"ÖM Indoor 2019"},null,null,null,null,null,null,null,null,null,null,null,"Mannschaft:",null,null,{"$f":"MC16_Baum!$C$47","v":"CM_2"}]
["Veranstaltung"]
[{"$f":"Select!$C$13","v":"09.-10. Februar 2019"},null,null,null,null,null,null,null,null,null,null,null,"Schützen:",null,null,{"$f":"MC16_Baum!$C$48","v":"Schütze1_CM2 Schütze2_CM2"}]
["Datum"]
["Bewerb:",null,{"$f":"Select!$C$14","v":"Mannschaftsbewerb"},null,null,null,null,null,null,null,null,null,"Bogenklasse:",null,null,{"$f":"Select!$C$20","v":"Compound Damen"}]
[]
[]
[]
["1/8 Elimination",null,null,null,null,{"$f":"MC16_Baum!$C$70","v":"Scheibe: 66"},null,null,null,null,null,null,"1/4 Finale",null,null,null,null,{"$f":"MC16_Baum!$G$62","v":"Scheibe: 48"}]
[null,1,2,"Summe","Gesamt",null,null,null,null,null,null,null,null,1,2,"Summe","Gesamt"]
[1,null,null,null,null,null,null,null,null,null,null,null,1]
[]
[2,null,null,null,null,null,null,null,null,null,null,null,2]
[null,null,null,null,null,null,"Stechen (wenn erf.)",null,null,null,null,null,null,null,null,null,null,null,"Stechen (wenn erf.)"]
[3,null,null,null,null,null,1,null,null,null,null,null,3,null,null,null,null,null,1]
[null,null,null,null,null,null,2,null,null,null,null,null,null,null,null,null,null,null,2]
[4,null,null,null,null,null,null,null,null,null,null,null,4]
[null,null,null,null,null,null,null,"gewonnen",null,null,null,null,null,null,null,null,null,null,null,"gewonnen"]
[null,null,null,null,null,null,null,"verloren",null,null,null,null,null,null,null,null,null,null,null,"verloren"]
[]
[null,"Schreiber:",null,null,null,null,"Kontrolle:",null,null,null,null,null,null,"Schreiber:",null,null,null,null,"Kontrolle:"]
[]
[]
[]
["1/2 Finale",null,null,null,null,{"$f":"MC16_Baum!$K$58","v":"Scheibe: 34"},null,null,null,null,null,null,"1./2. od. 3./4. Platz",null,null,null,null,"Scheibe:"]
[null,1,2,"Summe","Gesamt",null,null,null,null,null,null,null,null,1,2,"Summe","Gesamt"]
[1,null,null,null,null,null,null,null,null,null,null,null,1]
[]
[2,null,null,null,null,null,null,null,null,null,null,null,2]
[null,null,null,null,null,null,"Stechen (wenn erf.)",null,null,null,null,null,null,null,null,null,null,null,"Stechen (wenn erf.)"]
[3,null,null,null,null,null,1,null,null,null,null,null,3,null,null,null,null,null,1]
[null,null,null,null,null,null,2,null,null,null,null,null,null,null,null,null,null,null,2]
[4,null,null,null,null,null,null,null,null,null,null,null,4]
[null,null,null,null,null,null,null,"gewonnen",null,null,null,null,null,null,null,null,null,null,null,"gewonnen"]
[null,null,null,null,null,null,null,"verloren",null,null,null,null,null,null,null,null,null,null,null,"verloren"]
[]
[null,"Schreiber:",null,null,null,null,"Kontrolle:",null,null,null,null,null,null,"Schreiber:",null,null,null,null,"Kontrolle:"]

{"sheet":"MC16_Ergebnis","index":18,"n_rows":25,"n_cols":17,"rows_kept":25,"cut":false,"hidden":true,"merged":[[6,10,6,17],[1,0,1,3],[1,4,1,8],[2,0,2,3],[4,0,4,8],[6,0,6,3]]}
[]
[{"$f":"Select!$C$12","v":"ÖM Indoor 2019"}]
[{"$f":"Select!C13","v":"09.-10. Februar 2019"}]
[]
["Ergebnisliste"]
[]
[{"$f":"CONCATENATE(Select!C14,\" \",Select!C20)","v":"Mannschaftsbewerb Compound Damen"},null,null,null,null,null,null,null,null,null,"!!!!!!!!!!!!!!!!!!!!!!!!!!  SORTIERBEREICH - NICHT ENTFERNEN !!!!!!!!!!!!!!!!!!!!!!!!!!"]
[]
["Pl.",null,"Mannschaft","Schützen","Quali.","1/8","1/4","1/2","Finale",null,"SortMannschaft","SortSchützen","SortQuali","Sort 1/8","Sort1/4","Sort1/2","SortFinale"]
[{"$f":"IF(C10<>\"\",1,\"\")","v":""},null,null,null,null,null,null,null,null,null,{"$f":"IF(MC16_Baum!$P$21>MC16_Baum!$P$23,MC16_Baum!$O$21,IF(MC16_Baum!$P$23>MC16_Baum!$P$21,MC16_Baum!$O$23,IF(RIGHT(MC16_Baum!$P$21,1)=\"*\",MC16_Baum!$O$21,IF(RIGHT(MC16_Baum!$P$23,1)=\"*\",MC16_Baum!$O$23,\"\"))))","v":""},{"$f":"VLOOKUP(K10,MC_Quali!$C$10:$D$29,2,FALSE)","v":{"$error":"#N/A"}},{"$f":"VLOOKUP(K10,MC_Quali!$C$10:$G$29,5,FALSE)","v":{"$error":"#N/A"}},{"$f":"VLOOKUP(K10,MC16_Baum!$C$3:$D$48,2,FALSE)","v":{"$error":"#N/A"}},{"$f":"VLOOKUP(K10,MC16_Baum!$G$6:$H$45,2,FALSE)","v":0},{"$f":"VLOOKUP(K10,MC16_Baum!$K$12:$L$39,2,FALSE)","v":0},{"$f":"VLOOKUP(K10,MC16_Baum!$O$21:$P$30,2,FALSE)","v":0}]
[{"$f":"IF(C11<>\"\",A10+1,\"\")","v":""},null,null,null,null,null,null,null,null,null,{"$f":"IF(MC16_Baum!$P$21<MC16_Baum!$P$23,MC16_Baum!$O$21,IF(MC16_Baum!$P$23<MC16_Baum!$P$21,MC16_Baum!$O$23,IF(RIGHT(MC16_Baum!$P$21,1)=\"*\",MC16_Baum!$O$23,IF(RIGHT(MC16_Baum!$P$23,1)=\"*\",MC16_Baum!$O$21,\"\"))))","v":""},{"$f":"VLOOKUP(K11,MC_Quali!$C$10:$D$29,2,FALSE)","v":{"$error":"#N/A"}},{"$f":"VLOOKUP(K11,MC_Quali!$C$10:$G$29,5,FALSE)","v":{"$error":"#N/A"}},{"$f":"VLOOKUP(K11,MC16_Baum!$C$3:$D$48,2,FALSE)","v":{"$error":"#N/A"}},{"$f":"VLOOKUP(K11,MC16_Baum!$G$6:$H$45,2,FALSE)","v":0},{"$f":"VLOOKUP(K11,MC16_Baum!$K$12:$L$39,2,FALSE)","v":0},{"$f":"VLOOKUP(K11,MC16_Baum!$O$21:$P$30,2,FALSE)","v":0}]
["",null,null,null,null,null,null,null,null,null,{"$f":"IF(MC16_Baum!$P$27>MC16_Baum!$P$29,MC16_Baum!$O$27,IF(MC16_Baum!$P$29>MC16_Baum!$P$27,MC16_Baum!$O$29,IF(RIGHT(MC16_Baum!$P$27,1)=\"*\",MC16_Baum!$O$27,IF(RIGHT(MC16_Baum!$P$29,1)=\"*\",MC16_Baum!$O$29,\"\"))))","v":""},{"$f":"VLOOKUP(K12,MC_Quali!$C$10:$D$29,2,FALSE)","v":{"$error":"#N/A"}},{"$f":"VLOOKUP(K12,MC_Quali!$C$10:$G$29,5,FALSE)","v":{"$error":"#N/A"}},{"$f":"VLOOKUP(K12,MC16_Baum!$C$3:$D$48,2,FALSE)","v":{"$error":"#N/A"}},{"$f":"VLOOKUP(K12,MC16_Baum!$G$6:$H$45,2,FALSE)","v":0},{"$f":"VLOOKUP(K12,MC16_Baum!$K$12:$L$39,2,FALSE)","v":0},{"$f":"VLOOKUP(K12,MC16_Baum!$O$21:$P$30,2,FALSE)","v":0}]
["",null,null,null,null,null,null,null,null,null,{"$f":"IF(MC16_Baum!$P$27<MC16_Baum!$P$29,MC16_Baum!$O$27,IF(MC16_Baum!$P$29<MC16_Baum!$P$27,MC16_Baum!$O$29,IF(RIGHT(MC16_Baum!$P$27,1)=\"*\",MC16_Baum!$O$29,IF(RIGHT(MC16_Baum!$P$29,1)=\"*\",MC16_Baum!$O$27,\"\"))))","v":""},{"$f":"VLOOKUP(K13,MC_Quali!$C$10:$D$29,2,FALSE)","v":{"$error":"#N/A"}},{"$f":"VLOOKUP(K13,MC_Quali!$C$10:$G$29,5,FALSE)","v":{"$error":"#N/A"}},{"$f":"VLOOKUP(K13,MC16_Baum!$C$3:$D$48,2,FALSE)","v":{"$error":"#N/A"}},{"$f":"VLOOKUP(K13,MC16_Baum!$G$6:$H$45,2,FALSE)","v":0},{"$f":"VLOOKUP(K13,MC16_Baum!$K$12:$L$39,2,FALSE)","v":0},{"$f":"VLOOKUP(K13,MC16_Baum!$O$21:$P$30,2,FALSE)","v":0}]
["",null,null,null,null,null,null,null,null,null,{"$f":"IF(MC16_Baum!$H$6<MC16_Baum!$H$8,MC16_Baum!$G$6,IF(MC16_Baum!$H$8<MC16_Baum!$H$6,MC16_Baum!$G$8,IF(RIGHT(MC16_Baum!$H$6,1)=\"*\",MC16_Baum!$G$8,IF(RIGHT(MC16_Baum!$H$8,1)=\"*\",MC16_Baum!$G$6,\"\"))))","v":""},{"$f":"VLOOKUP(K14,MC_Quali!$C$10:$D$29,2,FALSE)","v":{"$error":"#N/A"}},{"$f":"VLOOKUP(K14,MC_Quali!$C$10:$G$29,5,FALSE)","v":{"$error":"#N/A"}},{"$f":"VLOOKUP(K14,MC16_Baum!$C$3:$D$48,2,FALSE)","v":{"$error":"#N/A"}},{"$f":"VLOOKUP(K14,MC16_Baum!$G$6:$H$45,2,FALSE)","v":0}]
["",null,null,null,null,null,null,null,null,null,{"$f":"IF(MC16_Baum!$H$18<MC16_Baum!$H$20,MC16_Baum!$G$18,IF(MC16_Baum!$H$20<MC16_Baum!$H$18,MC16_Baum!$G$20,IF(RIGHT(MC16_Baum!$H$18,1)=\"*\",MC16_Baum!$G$20,IF(RIGHT(MC16_Baum!$H$20,1)=\"*\",MC16_Baum!$G$18,\"\"))))","v":""},{"$f":"VLOOKUP(K15,MC_Quali!$C$10:$D$29,2,FALSE)","v":{"$error":"#N/A"}},{"$f":"VLOOKUP(K15,MC_Quali!$C$10:$G$29,5,FALSE)","v":{"$error":"#N/A"}},{"$f":"VLOOKUP(K15,MC16_Baum!$C$3:$D$48,2,FALSE)","v":{"$error":"#N/A"}},{"$f":"VLOOKUP(K15,MC16_Baum!$G$6:$H$45,2,FALSE)","v":0}]
["",null,null,null,null,null,null,null,null,null,{"$f":"IF(MC16_Baum!$H$30<MC16_Baum!$H$32,MC16_Baum!$G$30,IF(MC16_Baum!$H$32<MC16_Baum!$H$30,MC16_Baum!$G$32,IF(RIGHT(MC16_Baum!$H$30,1)=\"*\",MC16_Baum!$G$32,IF(RIGHT(MC16_Baum!$H$32,1)=\"*\",MC16_Baum!$G$30,\"\"))))","v":""},{"$f":"VLOOKUP(K16,MC_Quali!$C$10:$D$29,2,FALSE)","v":{"$error":"#N/A"}},{"$f":"VLOOKUP(K16,MC_Quali!$C$10:$G$29,5,FALSE)","v":{"$error":"#N/A"}},{"$f":"VLOOKUP(K16,MC16_Baum!$C$3:$D$48,2,FALSE)","v":{"$error":"#N/A"}},{"$f":"VLOOKUP(K16,MC16_Baum!$G$6:$H$45,2,FALSE)","v":0}]
["",null,null,null,null,null,null,null,null,null,{"$f":"IF(MC16_Baum!$H$42<MC16_Baum!$H$44,MC16_Baum!$G$42,IF(MC16_Baum!$H$44<MC16_Baum!$H$42,MC16_Baum!$G$44,IF(RIGHT(MC16_Baum!$H$42,1)=\"*\",MC16_Baum!$G$44,IF(RIGHT(MC16_Baum!$H$44,1)=\"*\",MC16_Baum!$G$42,\"\"))))","v":""},{"$f":"VLOOKUP(K17,MC_Quali!$C$10:$D$29,2,FALSE)","v":{"$error":"#N/A"}},{"$f":"VLOOKUP(K17,MC_Quali!$C$10:$G$29,5,FALSE)","v":{"$error":"#N/A"}},{"$f":"VLOOKUP(K17,MC16_Baum!$C$3:$D$48,2,FALSE)","v":{"$error":"#N/A"}},{"$f":"VLOOKUP(K17,MC16_Baum!$G$6:$H$45,2,FALSE)","v":0}]
["",null,null,null,null,null,null,null,null,null,{"$f":"IF(MC16_Baum!G6=MC16_Baum!C3,MC16_Baum!C5,MC16_Baum!C3)","v":"CM_1"},{"$f":"VLOOKUP(K18,MC_Quali!$C$10:$D$29,2,FALSE)","v":"Schütze1_CM1 Schütze2_CM1"},{"$f":"VLOOKUP(K18,MC_Quali!$C$10:$G$29,5,FALSE)","v":632},{"$f":"VLOOKUP(K18,MC16_Baum!$C$3:$D$48,2,FALSE)","v":0}]
["",null,null,null,null,null,null,null,null,null,{"$f":"IF(MC16_Baum!G8=MC16_Baum!C9,MC16_Baum!C11,MC16_Baum!C9)","v":"CM_9"},{"$f":"VLOOKUP(K19,MC_Quali!$C$10:$D$29,2,FALSE)","v":"Schütze1_CM9 Schütze2_CM9"},{"$f":"VLOOKUP(K19,MC_Quali!$C$10:$G$29,5,FALSE)","v":624},{"$f":"VLOOKUP(K19,MC16_Baum!$C$3:$D$48,2,FALSE)","v":0}]
["",null,null,null,null,null,null,null,null,null,{"$f":"IF(MC16_Baum!G18=MC16_Baum!C15,MC16_Baum!C17,MC16_Baum!C15)","v":"CM_5"},{"$f":"VLOOKUP(K20,MC_Quali!$C$10:$D$29,2,FALSE)","v":"Schütze1_CM5 Schütze2_CM5"},{"$f":"VLOOKUP(K20,MC_Quali!$C$10:$G$29,5,FALSE)","v":628},{"$f":"VLOOKUP(K20,MC16_Baum!$C$3:$D$48,2,FALSE)","v":0}]
["",null,null,null,null,null,null,null,null,null,{"$f":"IF(MC16_Baum!G20=MC16_Baum!C21,MC16_Baum!C23,MC16_Baum!C21)","v":"CM_13"},{"$f":"VLOOKUP(K21,MC_Quali!$C$10:$D$29,2,FALSE)","v":"Schütze1_CM13  Schütze2_CM13 "},{"$f":"VLOOKUP(K21,MC_Quali!$C$10:$G$29,5,FALSE)","v":620},{"$f":"VLOOKUP(K21,MC16_Baum!$C$3:$D$48,2,FALSE)","v":0}]
["",null,null,null,null,null,null,null,null,null,{"$f":"IF(MC16_Baum!G30=MC16_Baum!C27,MC16_Baum!C29,MC16_Baum!C27)","v":"CM_3"},{"$f":"VLOOKUP(K22,MC_Quali!$C$10:$D$29,2,FALSE)","v":"Schütze1_CM3 Schütze2_CM3"},{"$f":"VLOOKUP(K22,MC_Quali!$C$10:$G$29,5,FALSE)","v":630},{"$f":"VLOOKUP(K22,MC16_Baum!$C$3:$D$48,2,FALSE)","v":0}]
["",null,null,null,null,null,null,null,null,null,{"$f":"IF(MC16_Baum!G32=MC16_Baum!C33,MC16_Baum!C35,MC16_Baum!C33)","v":"CM_11"},{"$f":"VLOOKUP(K23,MC_Quali!$C$10:$D$29,2,FALSE)","v":"Schütze1_CM11 Schütze2_CM11"},{"$f":"VLOOKUP(K23,MC_Quali!$C$10:$G$29,5,FALSE)","v":622},{"$f":"VLOOKUP(K23,MC16_Baum!$C$3:$D$48,2,FALSE)","v":0}]
["",null,null,null,null,null,null,null,null,null,{"$f":"IF(MC16_Baum!G42=MC16_Baum!C39,MC16_Baum!C41,MC16_Baum!C39)","v":"CM_7"},{"$f":"VLOOKUP(K24,MC_Quali!$C$10:$D$29,2,FALSE)","v":"Schütze1_CM7 Schütze2_CM7"},{"$f":"VLOOKUP(K24,MC_Quali!$C$10:$G$29,5,FALSE)","v":626},{"$f":"VLOOKUP(K24,MC16_Baum!$C$3:$D$48,2,FALSE)","v":0}]
["",null,null,null,null,null,null,null,null,null,{"$f":"IF(MC16_Baum!G44=MC16_Baum!C45,MC16_Baum!C47,MC16_Baum!C45)","v":"CM_15"},{"$f":"VLOOKUP(K25,MC_Quali!$C$10:$D$29,2,FALSE)","v":"Schütze1_CM15 Schütze2_CM15"},{"$f":"VLOOKUP(K25,MC_Quali!$C$10:$G$29,5,FALSE)","v":618},{"$f":"VLOOKUP(K25,MC16_Baum!$C$3:$D$48,2,FALSE)","v":0}]

{"sheet":"MC8_Baum","index":19,"n_rows":62,"n_cols":12,"rows_kept":62,"cut":false,"hidden":true,"merged":[[1,6,2,11],[3,6,4,11],[41,6,42,7],[6,10,6,11],[7,10,7,11],[6,9,7,9],[8,9,9,9],[10,10,10,11],[11,10,11,11],[8,10,8,11],[9,10,9,11],[38,10,39,11],[47,2,48,3],[43,1,44,1],[35,5,36,5],[17,1,18,1],[19,1,20,1],[29,1,30,1],[31,1,32,1],[45,7,46,11],[5,1,6,1],[7,1,8,1],[11,5,12,5],[13,5,14,5],[10,9,11,9],[41,1,42,1],[37,5,38,5],[20,9,21,9],[22,9,23,9],[26,9,27,9],[28,9,29,9]]}
[]
[null,null,null,null,null,null,{"$f":"Select!C12","v":"ÖM Indoor 2019"}]
[]
[null,null,null,null,null,null,{"$f":"Select!C13","v":"09.-10. Februar 2019"}]
[null,"Schb","Name","Erg."]
[null,{"$f":"D55","v":11},{"$f":"MC_Quali!C10","v":"CM_1"}]
[1,null,{"$f":"MC_Quali!D10","v":"Schütze1_CM1 Schütze2_CM1"},{"$f":"MC_Quali!G10","v":632},"Quali.",null,null,null,null,"1.",{"$f":"IF($L$21>$L$23,$K$21,IF($L$23>$L$21,$K$23,IF(RIGHT($L$21,1)=\"*\",$K$21,IF(RIGHT($L$23,1)=\"*\",$K$23,\"\"))))","v":""}]
[8,{"$f":"D56","v":12},{"$f":"MC_Quali!C17","v":"CM_8"},null,null,null,null,null,null,null,{"$f":"IF($L$21>$L$23,$K$22,IF($L$23>$L$21,$K$24,IF(RIGHT($L$21,1)=\"*\",$K$22,IF(RIGHT($L$23,1)=\"*\",$K$24,\"\"))))","v":""}]
[null,null,{"$f":"MC_Quali!D17","v":"Schütze1_CM8 Schütze2_CM8"},{"$f":"MC_Quali!G17","v":625},"Quali.",null,null,null,null,"2.",{"$f":"IF($L$21<$L$23,$K$21,IF($L$23<$L$21,$K$23,IF(RIGHT($L$21,1)=\"\",$K$21,IF(RIGHT($L$23,1)=\"\",$K$23,\"\"))))","v":""}]
[null,null,null,null,null,null,null,null,null,null,{"$f":"IF($L$21<$L$23,$K$22,IF($L$23<$L$21,$K$24,IF(RIGHT($L$21,1)=\"\",$K$22,IF(RIGHT($L$23,1)=\"\",$K$24,\"\"))))","v":""}]
[null,null,null,null,null,"Schb","Name","Erg.",null,"3.",{"$f":"IF($L$27>$L$29,$K$27,IF($L$29>$L$27,$K$29,IF(RIGHT($L$27,1)=\"*\",$K$27,IF(RIGHT($L$29,1)=\"*\",$K$29,\"\"))))","v":""}]
[null,null,null,null,null,{"$f":"H55","v":11},{"$f":"IF($D6>$D8,$C6,IF($D8>$D6,$C8,IF(RIGHT($D6,1)=\"*\",$C6,IF(RIGHT($D8,1)=\"*\",$C8,\"\"))))","v":""},null,null,null,{"$f":"IF($L$27>$L$29,$K$28,IF($L$29>$L$27,$K$30,IF(RIGHT($L$27,1)=\"*\",$K$28,IF(RIGHT($L$29,1)=\"*\",$K$30,\"\"))))","v":""}]
[null,null,null,null,null,null,{"$f":"IF($D6>$D8,$C7,IF($D8>$D6,$C9,IF(RIGHT($D6,1)=\"*\",$C7,IF(RIGHT($D8,1)=\"*\",$C9,\"\"))))","v":""}]
[null,null,null,null,null,{"$f":"H56","v":12},{"$f":"IF($D18>$D20,$C18,IF($D20>$D18,$C20,IF(RIGHT($D18,1)=\"*\",$C18,IF(RIGHT($D20,1)=\"*\",$C20,\"\"))))","v":""}]
[null,null,null,null,null,null,{"$f":"IF($D18>$D20,$C19,IF($D20>$D18,$C21,IF(RIGHT($D18,1)=\"*\",$C19,IF(RIGHT($D20,1)=\"*\",$C21,\"\"))))","v":""}]
[]
[]
[null,{"$f":"D57","v":13},{"$f":"MC_Quali!C14","v":"CM_5"},null,null,null,null,null,null,null,""]
[5,null,{"$f":"MC_Quali!D14","v":"Schütze1_CM5 Schütze2_CM5"},{"$f":"MC_Quali!G14","v":628},"Quali.",null,null,null,null,null,""]
[4,{"$f":"D58","v":14},{"$f":"MC_Quali!C13","v":"CM_4"},null,null,null,null,null,null,"Schb","Name","Erg."]
[null,null,{"$f":"MC_Quali!D13","v":"Schütze1_CM4 Schütze2_CM4"},{"$f":"MC_Quali!G13","v":629},"Quali.",null,null,null,null,{"$f":"L55","v":11},{"$f":"IF($H12>$H14,$G12,IF($H14>$H12,$G14,IF(RIGHT($H12,1)=\"*\",$G12,IF(RIGHT($H14,1)=\"*\",$G14,\"\"))))","v":""}]
[null,null,null,null,null,null,null,"Finale",null,null,{"$f":"IF($H12>$H14,$G13,IF($H14>$H12,$G15,IF(RIGHT($H12,1)=\"*\",$G13,IF(RIGHT($H14,1)=\"*\",$G15,\"\"))))","v":""}]
[null,null,null,null,null,null,null,"1. und 2. Platz",null,{"$f":"L56","v":12},{"$f":"IF($H36>$H38,$G36,IF($H38>$H36,$G38,IF(RIGHT($H36,1)=\"*\",$G36,IF(RIGHT($H38,1)=\"*\",$G38,\"\"))))","v":""}]
[null,null,null,null,null,null,null,null,null,null,{"$f":"IF($H36>$H38,$G37,IF($H38>$H36,$G39,IF(RIGHT($H36,1)=\"*\",$G37,IF(RIGHT($H38,1)=\"*\",$G39,\"\"))))","v":""}]
[]
[]
[null,null,null,null,null,null,null,null,null,{"$f":"L57","v":10},{"$f":"IF($H12<$H14,$G12,IF($H14<$H12,$G14,IF(RIGHT($H12,1)=\"*\",$G14,IF(RIGHT($H14,1)=\"*\",$G12,\"\"))))","v":""}]
[null,null,null,null,null,null,null,"Finale",null,null,{"$f":"IF($H12<$H14,$G13,IF($H14<$H12,$G15,IF(RIGHT($H12,1)=\"*\",$G12,IF(RIGHT($H14,1)=\"*\",$G14,\"\"))))","v":""}]
[null,null,null,null,null,null,null,"3. und 4. Platz",null,{"$f":"L58","v":11},{"$f":"IF($H36<$H38,$G36,IF($H38<$H36,$G38,IF(RIGHT($H36,1)=\"*\",$G38,IF(RIGHT($H38,1)=\"*\",$G36,\"\"))))","v":""}]
[null,{"$f":"D59","v":15},{"$f":"MC_Quali!C12","v":"CM_3"},null,null,null,null,null,null,null,{"$f":"IF($H36<$H38,$G37,IF($H38<$H36,$G39,IF(RIGHT($H36,1)=\"*\",$G39,IF(RIGHT($H38,1)=\"*\",$G37,\"\"))))","v":""}]
[3,null,{"$f":"MC_Quali!D12","v":"Schütze1_CM3 Schütze2_CM3"},{"$f":"MC_Quali!G12","v":630},"Quali."]
[6,{"$f":"D60","v":16},{"$f":"MC_Quali!C15","v":"CM_6"}]
[null,null,{"$f":"MC_Quali!D15","v":"Schütze1_CM6 Schütze2_CM6"},{"$f":"MC_Quali!G15","v":627},"Quali."]
[]
[]
[null,null,null,null,null,{"$f":"H57","v":13},{"$f":"IF($D30>$D32,$C30,IF($D32>$D30,$C32,IF(RIGHT($D30,1)=\"*\",$C30,IF(RIGHT($D32,1)=\"*\",$C32,\"\"))))","v":""}]
[null,null,null,null,null,null,{"$f":"IF($D30>$D32,$C31,IF($D32>$D30,$C33,IF(RIGHT($D30,1)=\"*\",$C31,IF(RIGHT($D32,1)=\"*\",$C33,\"\"))))","v":""}]
[null,null,null,null,null,{"$f":"H58","v":14},{"$f":"IF($D42>$D44,$C42,IF($D44>$D42,$C44,IF(RIGHT($D42,1)=\"*\",$C42,IF(RIGHT($D44,1)=\"*\",$C44,\"\"))))","v":""}]
[null,null,null,null,null,null,{"$f":"IF($D42>$D44,$C43,IF($D44>$D42,$C45,IF(RIGHT($D42,1)=\"*\",$C43,IF(RIGHT($D44,1)=\"*\",$C45,\"\"))))","v":""},null,null,null,"Finale"]
[]
[]
[null,{"$f":"D61","v":17},{"$f":"MC_Quali!C16","v":"CM_7"},null,null,null,"1/2 Finale"]
[7,null,{"$f":"MC_Quali!D16","v":"Schütze1_CM7 Schütze2_CM7"},{"$f":"MC_Quali!G16","v":626},"Quali."]
[2,{"$f":"D62","v":18},{"$f":"MC_Quali!C11","v":"CM_2"}]
[null,null,{"$f":"MC_Quali!D11","v":"Schütze1_CM2 Schütze2_CM2"},{"$f":"MC_Quali!G11","v":631},"Quali."]
[null,null,null,null,null,null,null,{"$f":"CONCATENATE(Select!C14,\" \",Select!C20)","v":"Mannschaftsbewerb Compound Damen"}]
[]
[null,null,"1/4 Finale"]
[null,null,null,null,null,null,null,null,null,"*","= Im Stechen gewonnen"]
[]
[]
[]
[]
[null,null,"Scheibe:"]
[null,1,{"$f":"CONCATENATE($C$54,\" \",D55)","v":"Scheibe: 11"},11,null,1,{"$f":"CONCATENATE($C$54,\" \",H55)","v":"Scheibe: 11"},11,null,1,{"$f":"CONCATENATE($C$54,\" \",L55)","v":"Scheibe: 11"},11]
[null,null,"Scheibe: 12",{"$f":"IF(RIGHT(D55,1)=\"A\",CONCATENATE(LEFT(D55,LEN(D55)-1),\"B\"),D55+1)","v":12},null,null,{"$f":"CONCATENATE($C$54,\" \",H56)","v":"Scheibe: 12"},{"$f":"IF(RIGHT(H55,1)=\"A\",CONCATENATE(LEFT(H55,LEN(H55)-1),\"B\"),H55+1)","v":12},null,null,{"$f":"CONCATENATE($C$54,\" \",L56)","v":"Scheibe: 12"},{"$f":"IF(RIGHT(L55,1)=\"A\",CONCATENATE(LEFT(L55,LEN(L55)-1),\"B\"),L55+1)","v":12}]
[null,{"$f":"B55+1","v":2},"Scheibe: 13",{"$f":"IF(RIGHT(D56,1)=\"B\",CONCATENATE(LEFT(D56,LEN(D56)-1)+1,\"A\"),D56+1)","v":13},null,{"$f":"F55+1","v":2},{"$f":"CONCATENATE($C$54,\" \",H57)","v":"Scheibe: 13"},{"$f":"IF(RIGHT(H56,1)=\"B\",CONCATENATE(LEFT(H56,LEN(H56)-1)+1,\"A\"),H56+1)","v":13},null,{"$f":"J55+1","v":2},{"$f":"CONCATENATE($C$54,\" \",L57)","v":"Scheibe: 10"},10]
[null,null,"Scheibe: 14",{"$f":"IF(RIGHT(D57,1)=\"A\",CONCATENATE(LEFT(D57,LEN(D57)-1),\"B\"),D57+1)","v":14},null,null,{"$f":"CONCATENATE($C$54,\" \",H58)","v":"Scheibe: 14"},{"$f":"IF(RIGHT(H57,1)=\"A\",CONCATENATE(LEFT(H57,LEN(H57)-1),\"B\"),H57+1)","v":14},null,null,{"$f":"CONCATENATE($C$54,\" \",L58)","v":"Scheibe: 11"},{"$f":"IF(RIGHT(L57,1)=\"A\",CONCATENATE(LEFT(L57,LEN(L57)-1),\"B\"),L57+1)","v":11}]
[null,{"$f":"B57+1","v":3},"Scheibe: 15",{"$f":"IF(RIGHT(D58,1)=\"B\",CONCATENATE(LEFT(D58,LEN(D58)-1)+1,\"A\"),D58+1)","v":15}]
[null,null,"Scheibe: 16",{"$f":"IF(RIGHT(D59,1)=\"A\",CONCATENATE(LEFT(D59,LEN(D59)-1),\"B\"),D59+1)","v":16}]
[null,{"$f":"B59+1","v":4},"Scheibe: 17",{"$f":"IF(RIGHT(D60,1)=\"B\",CONCATENATE(LEFT(D60,LEN(D60)-1)+1,\"A\"),D60+1)","v":17}]
[null,null,"Scheibe: 18",{"$f":"IF(RIGHT(D61,1)=\"A\",CONCATENATE(LEFT(D61,LEN(D61)-1),\"B\"),D61+1)","v":18}]

{"sheet":"MC8","index":20,"n_rows":366,"n_cols":20,"rows_kept":366,"cut":false,"hidden":true,"merged":[[360,0,362,0],[360,12,362,12],[351,0,353,0],[351,12,353,12],[354,0,356,0],[354,12,356,12],[357,0,359,0],[357,12,359,12],[335,0,337,0],[335,12,337,12],[349,0,349,4],[349,5,349,10],[349,12,349,16],[349,17,349,22],[327,15,327,21],[330,0,330,4],[330,5,330,10],[330,12,330,16],[330,17,330,22],[332,0,334,0],[332,12,334,12],[314,0,316,0],[314,12,316,12],[323,0,323,9],[323,15,323,21],[324,0,324,9],[325,0,325,9],[325,15,326,21],[326,0,326,9],[338,12,340,12],[341,12,343,12],[327,2,327,10],[305,0,307,0],[305,12,307,12],[308,0,310,0],[308,12,310,12],[311,0,313,0],[311,12,313,12],[289,0,291,0],[289,12,291,12],[303,0,303,4],[303,5,303,10],[303,12,303,16],[303,17,303,22],[281,15,281,21],[284,0,284,4],[284,5,284,10],[284,12,284,16],[284,17,284,22],[286,0,288,0],[286,12,288,12],[268,0,270,0],[268,12,270,12],[277,0,277,9],[277,15,277,21],[278,0,278,9],[279,0,279,9],[279,15,280,21],[280,0,280,9],[292,12,294,12],[295,12,297,12],[281,2,281,10],[259,0,261,0],[259,12,261,12],[262,0,264,0],[262,12,264,12],[265,0,267,0],[265,12,267,12],[243,0,245,0],[243,12,245,12],[257,0,257,4],[257,5,257,10],[257,12,257,16],[257,17,257,22],[235,15,235,21],[238,0,238,4],[238,5,238,10],[238,12,238,16],[238,17,238,22],[240,0,242,0],[240,12,242,12],[222,0,224,0],[222,12,224,12],[231,0,231,9],[231,15,231,21],[232,0,232,9],[233,0,233,9],[233,15,234,21],[234,0,234,9],[246,12,248,12],[249,12,251,12],[235,2,235,10],[213,0,215,0],[213,12,215,12],[216,0,218,0],[216,12,218,12],[219,0,221,0],[219,12,221,12],[197,0,199,0],[197,12,199,12],[211,0,211,4],[211,5,211,10],[211,12,211,16],[211,17,211,22],[189,15,189,21],[192,0,192,4],[192,5,192,10],[192,12,192,16],[192,17,192,22],[194,0,196,0],[194,12,196,12],[176,0,178,0],[176,12,178,12],[185,0,185,9],[185,15,185,21],[186,0,186,9],[187,0,187,9],[187,15,188,21],[188,0,188,9],[200,12,202,12],[203,12,205,12],[189,2,189,10],[167,0,169,0],[167,12,169,12],[170,0,172,0],[170,12,172,12],[173,0,175,0],[173,12,175,12],[151,0,153,0],[151,12,153,12],[165,0,165,4],[165,5,165,10],[165,12,165,16],[165,17,165,22],[143,15,143,21],[146,0,146,4],[146,5,146,10],[146,12,146,16],[146,17,146,22],[148,0,150,0],[148,12,150,12],[130,0,132,0],[130,12,132,12],[139,0,139,9],[139,15,139,21],[140,0,140,9],[141,0,141,9],[141,15,142,21],[142,0,142,9],[154,12,156,12],[157,12,159,12],[143,2,143,10],[121,0,123,0],[121,12,123,12],[124,0,126,0],[124,12,126,12],[127,0,129,0],[127,12,129,12],[105,0,107,0],[105,12,107,12],[119,0,119,4],[119,5,119,10],[119,12,119,16],[119,17,119,22],[97,15,97,21],[100,0,100,4],[100,5,100,10],[100,12,100,16],[100,17,100,22],[102,0,104,0],[102,12,104,12],[84,0,86,0],[84,12,86,12],[93,0,93,9],[93,15,93,21],[94,0,94,9],[95,0,95,9],[95,15,96,21],[96,0,96,9],[108,12,110,12],[111,12,113,12],[97,2,97,10],[75,0,77,0],[75,12,77,12],[78,0,80,0],[78,12,80,12],[81,0,83,0],[81,12,83,12],[59,0,61,0],[59,12,61,12],[73,0,73,4],[73,5,73,10],[73,12,73,16],[73,17,73,22],[51,15,51,21],[54,0,54,4],[54,5,54,10],[54,12,54,16],[54,17,54,22],[56,0,58,0],[56,12,58,12],[38,0,40,0],[38,12,40,12],[47,0,47,9],[47,15,47,21],[48,0,48,9],[49,0,49,9],[49,15,50,21],[50,0,50,9],[62,12,64,12],[65,12,67,12],[51,2,51,10],[29,0,31,0],[29,12,31,12],[32,0,34,0],[32,12,34,12],[35,0,37,0],[35,12,37,12],[13,0,15,0],[13,12,15,12],[27,0,27,4],[27,5,27,10],[27,12,27,16],[27,17,27,22],[5,15,5,21],[8,0,8,4],[8,5,8,10],[8,12,8,16],[8,17,8,22],[10,0,12,0],[10,12,12,12],[1,0,1,9],[1,15,1,21],[2,0,2,9],[3,0,3,9],[3,15,4,21],[4,0,4,9],[19,12,21,12],[16,12,18,12],[5,2,5,10]]}
[]
[{"$f":"Select!$C$12","v":"ÖM Indoor 2019"},null,null,null,null,null,null,null,null,null,null,null,"Mannschaft:",null,null,{"$f":"MC8_Baum!$C$6","v":"CM_1"}]
["Veranstaltung"]
[{"$f":"Select!$C$13","v":"09.-10. Februar 2019"},null,null,null,null,null,null,null,null,null,null,null,"Schützen:",null,null,{"$f":"MC8_Baum!$C$7","v":"Schütze1_CM1 Schütze2_CM1"}]
["Datum"]
["Bewerb:",null,{"$f":"Select!$C$14","v":"Mannschaftsbewerb"},null,null,null,null,null,null,null,null,null,"Bogenklasse:",null,null,{"$f":"Select!$C$20","v":"Compound Damen"}]
[]
[]
[null,null,null,null,null,null,null,null,null,null,null,null,"1/4 Finale",null,null,null,null,{"$f":"MC8_Baum!$C$55","v":"Scheibe: 11"}]
[null,null,null,null,null,null,null,null,null,null,null,null,null,1,2,"Summe","Gesamt"]
[null,null,null,null,null,null,null,null,null,null,null,null,1]
[]
[]
[null,null,null,null,null,null,null,null,null,null,null,null,2]
[]
[null,null,null,null,null,null,null,null,null,null,null,null,null,null,null,null,null,null,"Stechen (wenn erf.)"]
[null,null,null,null,null,null,null,null,null,null,null,null,3,null,null,null,null,null,1]
[null,null,null,null,null,null,null,null,null,null,null,null,null,null,null,null,null,null,2]
[null,null,null,null,null,null,null,null,null,null,null,null,null,null,null,null,null,null,3]
[null,null,null,null,null,null,null,null,null,null,null,null,4]
[]
[null,null,null,null,null,null,null,null,null,null,null,null,null,null,null,null,null,null,null,"gewonnen"]
[null,null,null,null,null,null,null,null,null,null,null,null,null,null,null,null,null,null,null,"verloren"]
[]
[null,null,null,null,null,null,null,null,null,null,null,null,null,"Schreiber:",null,null,null,null,"Kontrolle:"]
[]
[]
["1/2 Finale",null,null,null,null,{"$f":"MC8_Baum!$G$55","v":"Scheibe: 11"},null,null,null,null,null,null,"1./2. od. 3./4. Platz",null,null,null,null,"Scheibe:"]
[null,1,2,"Summe","Gesamt",null,null,null,null,null,null,null,null,1,2,"Summe","Gesamt"]
[1,null,null,null,null,null,null,null,null,null,null,null,1]
[]
[]
[2,null,null,null,null,null,null,null,null,null,null,null,2]
[]
[null,null,null,null,null,null,"Stechen (wenn erf.)",null,null,null,null,null,null,null,null,null,null,null,"Stechen (wenn erf.)"]
[3,null,null,null,null,null,1,null,null,null,null,null,3,null,null,null,null,null,1]
[null,null,null,null,null,null,2,null,null,null,null,null,null,null,null,null,null,null,2]
[null,null,null,null,null,null,3,null,null,null,null,null,null,null,null,null,null,null,3]
[4,null,null,null,null,null,null,null,null,null,null,null,4]
[]
[null,null,null,null,null,null,null,"gewonnen",null,null,null,null,null,null,null,null,null,null,null,"gewonnen"]
[null,null,null,null,null,null,null,"verloren",null,null,null,null,null,null,null,null,null,null,null,"verloren"]
[]
[null,"Schreiber:",null,null,null,null,"Kontrolle:",null,null,null,null,null,null,"Schreiber:",null,null,null,null,"Kontrolle:"]
[]
[]
[]
[{"$f":"Select!$C$12","v":"ÖM Indoor 2019"},null,null,null,null,null,null,null,null,null,null,null,"Mannschaft:",null,null,{"$f":"MC8_Baum!$C$8","v":"CM_8"}]
["Veranstaltung"]
[{"$f":"Select!$C$13","v":"09.-10. Februar 2019"},null,null,null,null,null,null,null,null,null,null,null,"Schützen:",null,null,{"$f":"MC8_Baum!$C$9","v":"Schütze1_CM8 Schütze2_CM8"}]
["Datum"]
["Bewerb:",null,{"$f":"Select!$C$14","v":"Mannschaftsbewerb"},null,null,null,null,null,null,null,null,null,"Bogenklasse:",null,null,{"$f":"Select!$C$20","v":"Compound Damen"}]
[]
[]
[null,null,null,null,null,null,null,null,null,null,null,null,"1/4 Finale",null,null,null,null,{"$f":"MC8_Baum!$C$56","v":"Scheibe: 12"}]
[null,null,null,null,null,null,null,null,null,null,null,null,null,1,2,"Summe","Gesamt"]
[null,null,null,null,null,null,null,null,null,null,null,null,1]
[]
[]
[null,null,null,null,null,null,null,null,null,null,null,null,2]
[]
[null,null,null,null,null,null,null,null,null,null,null,null,null,null,null,null,null,null,"Stechen (wenn erf.)"]
[null,null,null,null,null,null,null,null,null,null,null,null,3,null,null,null,null,null,1]
[null,null,null,null,null,null,null,null,null,null,null,null,null,null,null,null,null,null,2]
[null,null,null,null,null,null,null,null,null,null,null,null,null,null,null,null,null,null,3]
[null,null,null,null,null,null,null,null,null,null,null,null,4]
[]
[null,null,null,null,null,null,null,null,null,null,null,null,null,null,null,null,null,null,null,"gewonnen"]
[null,null,null,null,null,null,null,null,null,null,null,null,null,null,null,null,null,null,null,"verloren"]
[]
[null,null,null,null,null,null,null,null,null,null,null,null,null,"Schreiber:",null,null,null,null,"Kontrolle:"]
[]
[]
["1/2 Finale",null,null,null,null,{"$f":"MC8_Baum!$G$55","v":"Scheibe: 11"},null,null,null,null,null,null,"1./2. od. 3./4. Platz",null,null,null,null,"Scheibe:"]
[null,1,2,"Summe","Gesamt",null,null,null,null,null,null,null,null,1,2,"Summe","Gesamt"]
[1,null,null,null,null,null,null,null,null,null,null,null,1]
[]
[]
[2,null,null,null,null,null,null,null,null,null,null,null,2]
[]
[null,null,null,null,null,null,"Stechen (wenn erf.)",null,null,null,null,null,null,null,null,null,null,null,"Stechen (wenn erf.)"]
[3,null,null,null,null,null,1,null,null,null,null,null,3,null,null,null,null,null,1]
[null,null,null,null,null,null,2,null,null,null,null,null,null,null,null,null,null,null,2]
[null,null,null,null,null,null,3,null,null,null,null,null,null,null,null,null,null,null,3]
[4,null,null,null,null,null,null,null,null,null,null,null,4]
[]
[null,null,null,null,null,null,null,"gewonnen",null,null,null,null,null,null,null,null,null,null,null,"gewonnen"]
[null,null,null,null,null,null,null,"verloren",null,null,null,null,null,null,null,null,null,null,null,"verloren"]
[]
[null,"Schreiber:",null,null,null,null,"Kontrolle:",null,null,null,null,null,null,"Schreiber:",null,null,null,null,"Kontrolle:"]
[]
[]
[]
[{"$f":"Select!$C$12","v":"ÖM Indoor 2019"},null,null,null,null,null,null,null,null,null,null,null,"Mannschaft:",null,null,{"$f":"MC8_Baum!$C$18","v":"CM_5"}]
["Veranstaltung"]
[{"$f":"Select!$C$13","v":"09.-10. Februar 2019"},null,null,null,null,null,null,null,null,null,null,null,"Schützen:",null,null,{"$f":"MC8_Baum!$C$19","v":"Schütze1_CM5 Schütze2_CM5"}]
["Datum"]
["Bewerb:",null,{"$f":"Select!$C$14","v":"Mannschaftsbewerb"},null,null,null,null,null,null,null,null,null,"Bogenklasse:",null,null,{"$f":"Select!$C$20","v":"Compound Damen"}]
[]
[]
[null,null,null,null,null,null,null,null,null,null,null,null,"1/4 Finale",null,null,null,null,{"$f":"MC8_Baum!$C$57","v":"Scheibe: 13"}]
[null,null,null,null,null,null,null,null,null,null,null,null,null,1,2,"Summe","Gesamt"]
[null,null,null,null,null,null,null,null,null,null,null,null,1]
[]
[]
[null,null,null,null,null,null,null,null,null,null,null,null,2]
[]
[null,null,null,null,null,null,null,null,null,null,null,null,null,null,null,null,null,null,"Stechen (wenn erf.)"]
[null,null,null,null,null,null,null,null,null,null,null,null,3,null,null,null,null,null,1]
[null,null,null,null,null,null,null,null,null,null,null,null,null,null,null,null,null,null,2]
[null,null,null,null,null,null,null,null,null,null,null,null,null,null,null,null,null,null,3]
[null,null,null,null,null,null,null,null,null,null,null,null,4]
[]
[null,null,null,null,null,null,null,null,null,null,null,null,null,null,null,null,null,null,null,"gewonnen"]
[null,null,null,null,null,null,null,null,null,null,null,null,null,null,null,null,null,null,null,"verloren"]
[]
[null,null,null,null,null,null,null,null,null,null,null,null,null,"Schreiber:",null,null,null,null,"Kontrolle:"]
[]
[]
["1/2 Finale",null,null,null,null,{"$f":"MC8_Baum!$G$56","v":"Scheibe: 12"},null,null,null,null,null,null,"1./2. od. 3./4. Platz",null,null,null,null,"Scheibe:"]
[null,1,2,"Summe","Gesamt",null,null,null,null,null,null,null,null,1,2,"Summe","Gesamt"]
[1,null,null,null,null,null,null,null,null,null,null,null,1]
[]
[]
[2,null,null,null,null,null,null,null,null,null,null,null,2]
[]
[null,null,null,null,null,null,"Stechen (wenn erf.)",null,null,null,null,null,null,null,null,null,null,null,"Stechen (wenn erf.)"]
[3,null,null,null,null,null,1,null,null,null,null,null,3,null,null,null,null,null,1]
[null,null,null,null,null,null,2,null,null,null,null,null,null,null,null,null,null,null,2]
[null,null,null,null,null,null,3,null,null,null,null,null,null,null,null,null,null,null,3]
[4,null,null,null,null,null,null,null,null,null,null,null,4]
[]
[null,null,null,null,null,null,null,"gewonnen",null,null,null,null,null,null,null,null,null,null,null,"gewonnen"]
[null,null,null,null,null,null,null,"verloren",null,null,null,null,null,null,null,null,null,null,null,"verloren"]
[]
[null,"Schreiber:",null,null,null,null,"Kontrolle:",null,null,null,null,null,null,"Schreiber:",null,null,null,null,"Kontrolle:"]
[]
[]
[]
[{"$f":"Select!$C$12","v":"ÖM Indoor 2019"},null,null,null,null,null,null,null,null,null,null,null,"Mannschaft:",null,null,{"$f":"MC8_Baum!$C$20","v":"CM_4"}]
["Veranstaltung"]
[{"$f":"Select!$C$13","v":"09.-10. Februar 2019"},null,null,null,null,null,null,null,null,null,null,null,"Schützen:",null,null,{"$f":"MC8_Baum!$C$21","v":"Schütze1_CM4 Schütze2_CM4"}]
["Datum"]
["Bewerb:",null,{"$f":"Select!$C$14","v":"Mannschaftsbewerb"},null,null,null,null,null,null,null,null,null,"Bogenklasse:",null,null,{"$f":"Select!$C$20","v":"Compound Damen"}]
[]
[]
[null,null,null,null,null,null,null,null,null,null,null,null,"1/4 Finale",null,null,null,null,{"$f":"MC8_Baum!$C$58","v":"Scheibe: 14"}]
[null,null,null,null,null,null,null,null,null,null,null,null,null,1,2,"Summe","Gesamt"]
[null,null,null,null,null,null,null,null,null,null,null,null,1]
[]
[]
[null,null,null,null,null,null,null,null,null,null,null,null,2]
[]
[null,null,null,null,null,null,null,null,null,null,null,null,null,null,null,null,null,null,"Stechen (wenn erf.)"]
[null,null,null,null,null,null,null,null,null,null,null,null,3,null,null,null,null,null,1]
[null,null,null,null,null,null,null,null,null,null,null,null,null,null,null,null,null,null,2]
[null,null,null,null,null,null,null,null,null,null,null,null,null,null,null,null,null,null,3]
[null,null,null,null,null,null,null,null,null,null,null,null,4]
[]
[null,null,null,null,null,null,null,null,null,null,null,null,null,null,null,null,null,null,null,"gewonnen"]
[null,null,null,null,null,null,null,null,null,null,null,null,null,null,null,null,null,null,null,"verloren"]
[]
[null,null,null,null,null,null,null,null,null,null,null,null,null,"Schreiber:",null,null,null,null,"Kontrolle:"]
[]
[]
["1/2 Finale",null,null,null,null,{"$f":"MC8_Baum!$G$56","v":"Scheibe: 12"},null,null,null,null,null,null,"1./2. od. 3./4. Platz",null,null,null,null,"Scheibe:"]
[null,1,2,"Summe","Gesamt",null,null,null,null,null,null,null,null,1,2,"Summe","Gesamt"]
[1,null,null,null,null,null,null,null,null,null,null,null,1]
[]
[]
[2,null,null,null,null,null,null,null,null,null,null,null,2]
[]
[null,null,null,null,null,null,"Stechen (wenn erf.)",null,null,null,null,null,null,null,null,null,null,null,"Stechen (wenn erf.)"]
[3,null,null,null,null,null,1,null,null,null,null,null,3,null,null,null,null,null,1]
[null,null,null,null,null,null,2,null,null,null,null,null,null,null,null,null,null,null,2]
[null,null,null,null,null,null,3,null,null,null,null,null,null,null,null,null,null,null,3]
[4,null,null,null,null,null,null,null,null,null,null,null,4]
[]
[null,null,null,null,null,null,null,"gewonnen",null,null,null,null,null,null,null,null,null,null,null,"gewonnen"]
[null,null,null,null,null,null,null,"verloren",null,null,null,null,null,null,null,null,null,null,null,"verloren"]
[]
[null,"Schreiber:",null,null,null,null,"Kontrolle:",null,null,null,null,null,null,"Schreiber:",null,null,null,null,"Kontrolle:"]
[]
[]
[]
[{"$f":"Select!$C$12","v":"ÖM Indoor 2019"},null,null,null,null,null,null,null,null,null,null,null,"Mannschaft:",null,null,{"$f":"MC8_Baum!$C$30","v":"CM_3"}]
["Veranstaltung"]
[{"$f":"Select!$C$13","v":"09.-10. Februar 2019"},null,null,null,null,null,null,null,null,null,null,null,"Schützen:",null,null,{"$f":"MC8_Baum!$C$31","v":"Schütze1_CM3 Schütze2_CM3"}]
["Datum"]
["Bewerb:",null,{"$f":"Select!$C$14","v":"Mannschaftsbewerb"},null,null,null,null,null,null,null,null,null,"Bogenklasse:",null,null,{"$f":"Select!$C$20","v":"Compound Damen"}]
[]
[]
[null,null,null,null,null,null,null,null,null,null,null,null,"1/4 Finale",null,null,null,null,{"$f":"MC8_Baum!$C$59","v":"Scheibe: 15"}]
[null,null,null,null,null,null,null,null,null,null,null,null,null,1,2,"Summe","Gesamt"]
[null,null,null,null,null,null,null,null,null,null,null,null,1]
[]
[]
[null,null,null,null,null,null,null,null,null,null,null,null,2]
[]
[null,null,null,null,null,null,null,null,null,null,null,null,null,null,null,null,null,null,"Stechen (wenn erf.)"]
[null,null,null,null,null,null,null,null,null,null,null,null,3,null,null,null,null,null,1]
[null,null,null,null,null,null,null,null,null,null,null,null,null,null,null,null,null,null,2]
[null,null,null,null,null,null,null,null,null,null,null,null,null,null,null,null,null,null,3]
[null,null,null,null,null,null,null,null,null,null,null,null,4]
[]
[null,null,null,null,null,null,null,null,null,null,null,null,null,null,null,null,null,null,null,"gewonnen"]
[null,null,null,null,null,null,null,null,null,null,null,null,null,null,null,null,null,null,null,"verloren"]
[]
[null,null,null,null,null,null,null,null,null,null,null,null,null,"Schreiber:",null,null,null,null,"Kontrolle:"]
[]
[]
["1/2 Finale",null,null,null,null,{"$f":"MC8_Baum!$G$57","v":"Scheibe: 13"},null,null,null,null,null,null,"1./2. od. 3./4. Platz",null,null,null,null,"Scheibe:"]
[null,1,2,"Summe","Gesamt",null,null,null,null,null,null,null,null,1,2,"Summe","Gesamt"]
[1,null,null,null,null,null,null,null,null,null,null,null,1]
[]
[]
[2,null,null,null,null,null,null,null,null,null,null,null,2]
[]
[null,null,null,null,null,null,"Stechen (wenn erf.)",null,null,null,null,null,null,null,null,null,null,null,"Stechen (wenn erf.)"]
[3,null,null,null,null,null,1,null,null,null,null,null,3,null,null,null,null,null,1]
[null,null,null,null,null,null,2,null,null,null,null,null,null,null,null,null,null,null,2]
[null,null,null,null,null,null,3,null,null,null,null,null,null,null,null,null,null,null,3]
[4,null,null,null,null,null,null,null,null,null,null,null,4]
[]
[null,null,null,null,null,null,null,"gewonnen",null,null,null,null,null,null,null,null,null,null,null,"gewonnen"]
[null,null,null,null,null,null,null,"verloren",null,null,null,null,null,null,null,null,null,null,null,"verloren"]
[]
[null,"Schreiber:",null,null,null,null,"Kontrolle:",null,null,null,null,null,null,"Schreiber:",null,null,null,null,"Kontrolle:"]
[]
[]
[]
[{"$f":"Select!$C$12","v":"ÖM Indoor 2019"},null,null,null,null,null,null,null,null,null,null,null,"Mannschaft:",null,null,{"$f":"MC8_Baum!$C$32","v":"CM_6"}]
["Veranstaltung"]
[{"$f":"Select!$C$13","v":"09.-10. Februar 2019"},null,null,null,null,null,null,null,null,null,null,null,"Schützen:",null,null,{"$f":"MC8_Baum!$C$33","v":"Schütze1_CM6 Schütze2_CM6"}]
["Datum"]
["Bewerb:",null,{"$f":"Select!$C$14","v":"Mannschaftsbewerb"},null,null,null,null,null,null,null,null,null,"Bogenklasse:",null,null,{"$f":"Select!$C$20","v":"Compound Damen"}]
[]
[]
[null,null,null,null,null,null,null,null,null,null,null,null,"1/4 Finale",null,null,null,null,{"$f":"MC8_Baum!$C$60","v":"Scheibe: 16"}]
[null,null,null,null,null,null,null,null,null,null,null,null,null,1,2,"Summe","Gesamt"]
[null,null,null,null,null,null,null,null,null,null,null,null,1]
[]
[]
[null,null,null,null,null,null,null,null,null,null,null,null,2]
[]
[null,null,null,null,null,null,null,null,null,null,null,null,null,null,null,null,null,null,"Stechen (wenn erf.)"]
[null,null,null,null,null,null,null,null,null,null,null,null,3,null,null,null,null,null,1]
[null,null,null,null,null,null,null,null,null,null,null,null,null,null,null,null,null,null,2]
[null,null,null,null,null,null,null,null,null,null,null,null,null,null,null,null,null,null,3]
[null,null,null,null,null,null,null,null,null,null,null,null,4]
[]
[null,null,null,null,null,null,null,null,null,null,null,null,null,null,null,null,null,null,null,"gewonnen"]
[null,null,null,null,null,null,null,null,null,null,null,null,null,null,null,null,null,null,null,"verloren"]
[]
[null,null,null,null,null,null,null,null,null,null,null,null,null,"Schreiber:",null,null,null,null,"Kontrolle:"]
[]
[]
["1/2 Finale",null,null,null,null,{"$f":"MC8_Baum!$G$57","v":"Scheibe: 13"},null,null,null,null,null,null,"1./2. od. 3./4. Platz",null,null,null,null,"Scheibe:"]
[null,1,2,"Summe","Gesamt",null,null,null,null,null,null,null,null,1,2,"Summe","Gesamt"]
[1,null,null,null,null,null,null,null,null,null,null,null,1]
[]
[]
[2,null,null,null,null,null,null,null,null,null,null,null,2]
[]
[null,null,null,null,null,null,"Stechen (wenn erf.)",null,null,null,null,null,null,null,null,null,null,null,"Stechen (wenn erf.)"]
[3,null,null,null,null,null,1,null,null,null,null,null,3,null,null,null,null,null,1]
[null,null,null,null,null,null,2,null,null,null,null,null,null,null,null,null,null,null,2]
[null,null,null,null,null,null,3,null,null,null,null,null,null,null,null,null,null,null,3]
[4,null,null,null,null,null,null,null,null,null,null,null,4]
[]
[null,null,null,null,null,null,null,"gewonnen",null,null,null,null,null,null,null,null,null,null,null,"gewonnen"]
[null,null,null,null,null,null,null,"verloren",null,null,null,null,null,null,null,null,null,null,null,"verloren"]
[]
[null,"Schreiber:",null,null,null,null,"Kontrolle:",null,null,null,null,null,null,"Schreiber:",null,null,null,null,"Kontrolle:"]
[]
[]
[]
[{"$f":"Select!$C$12","v":"ÖM Indoor 2019"},null,null,null,null,null,null,null,null,null,null,null,"Mannschaft:",null,null,{"$f":"MC8_Baum!$C$42","v":"CM_7"}]
["Veranstaltung"]
[{"$f":"Select!$C$13","v":"09.-10. Februar 2019"},null,null,null,null,null,null,null,null,null,null,null,"Schützen:",null,null,{"$f":"MC8_Baum!$C$43","v":"Schütze1_CM7 Schütze2_CM7"}]
["Datum"]
["Bewerb:",null,{"$f":"Select!$C$14","v":"Mannschaftsbewerb"},null,null,null,null,null,null,null,null,null,"Bogenklasse:",null,null,{"$f":"Select!$C$20","v":"Compound Damen"}]
[]
[]
[null,null,null,null,null,null,null,null,null,null,null,null,"1/4 Finale",null,null,null,null,{"$f":"MC8_Baum!$C$61","v":"Scheibe: 17"}]
[null,null,null,null,null,null,null,null,null,null,null,null,null,1,2,"Summe","Gesamt"]
[null,null,null,null,null,null,null,null,null,null,null,null,1]
[]
[]
[null,null,null,null,null,null,null,null,null,null,null,null,2]
[]
[null,null,null,null,null,null,null,null,null,null,null,null,null,null,null,null,null,null,"Stechen (wenn erf.)"]
[null,null,null,null,null,null,null,null,null,null,null,null,3,null,null,null,null,null,1]
[null,null,null,null,null,null,null,null,null,null,null,null,null,null,null,null,null,null,2]
[null,null,null,null,null,null,null,null,null,null,null,null,null,null,null,null,null,null,3]
[null,null,null,null,null,null,null,null,null,null,null,null,4]
[]
[null,null,null,null,null,null,null,null,null,null,null,null,null,null,null,null,null,null,null,"gewonnen"]
[null,null,null,null,null,null,null,null,null,null,null,null,null,null,null,null,null,null,null,"verloren"]
[]
[null,null,null,null,null,null,null,null,null,null,null,null,null,"Schreiber:",null,null,null,null,"Kontrolle:"]
[]
[]
["1/2 Finale",null,null,null,null,{"$f":"MC8_Baum!$G$58","v":"Scheibe: 14"},null,null,null,null,null,null,"1./2. od. 3./4. Platz",null,null,null,null,"Scheibe:"]
[null,1,2,"Summe","Gesamt",null,null,null,null,null,null,null,null,1,2,"Summe","Gesamt"]
[1,null,null,null,null,null,null,null,null,null,null,null,1]
[]
[]
[2,null,null,null,null,null,null,null,null,null,null,null,2]
[]
[null,null,null,null,null,null,"Stechen (wenn erf.)",null,null,null,null,null,null,null,null,null,null,null,"Stechen (wenn erf.)"]
[3,null,null,null,null,null,1,null,null,null,null,null,3,null,null,null,null,null,1]
[null,null,null,null,null,null,2,null,null,null,null,null,null,null,null,null,null,null,2]
[null,null,null,null,null,null,3,null,null,null,null,null,null,null,null,null,null,null,3]
[4,null,null,null,null,null,null,null,null,null,null,null,4]
[]
[null,null,null,null,null,null,null,"gewonnen",null,null,null,null,null,null,null,null,null,null,null,"gewonnen"]
[null,null,null,null,null,null,null,"verloren",null,null,null,null,null,null,null,null,null,null,null,"verloren"]
[]
[null,"Schreiber:",null,null,null,null,"Kontrolle:",null,null,null,null,null,null,"Schreiber:",null,null,null,null,"Kontrolle:"]
[]
[]
[]
[{"$f":"Select!$C$12","v":"ÖM Indoor 2019"},null,null,null,null,null,null,null,null,null,null,null,"Mannschaft:",null,null,{"$f":"MC8_Baum!$C$44","v":"CM_2"}]
["Veranstaltung"]
[{"$f":"Select!$C$13","v":"09.-10. Februar 2019"},null,null,null,null,null,null,null,null,null,null,null,"Schützen:",null,null,{"$f":"MC8_Baum!$C$45","v":"Schütze1_CM2 Schütze2_CM2"}]
["Datum"]
["Bewerb:",null,{"$f":"Select!$C$14","v":"Mannschaftsbewerb"},null,null,null,null,null,null,null,null,null,"Bogenklasse:",null,null,{"$f":"Select!$C$20","v":"Compound Damen"}]
[]
[]
[null,null,null,null,null,null,null,null,null,null,null,null,"1/4 Finale",null,null,null,null,{"$f":"MC8_Baum!$C$62","v":"Scheibe: 18"}]
[null,null,null,null,null,null,null,null,null,null,null,null,null,1,2,"Summe","Gesamt"]
[null,null,null,null,null,null,null,null,null,null,null,null,1]
[]
[]
[null,null,null,null,null,null,null,null,null,null,null,null,2]
[]
[null,null,null,null,null,null,null,null,null,null,null,null,null,null,null,null,null,null,"Stechen (wenn erf.)"]
[null,null,null,null,null,null,null,null,null,null,null,null,3,null,null,null,null,null,1]
[null,null,null,null,null,null,null,null,null,null,null,null,null,null,null,null,null,null,2]
[null,null,null,null,null,null,null,null,null,null,null,null,null,null,null,null,null,null,3]
[null,null,null,null,null,null,null,null,null,null,null,null,4]
[]
[null,null,null,null,null,null,null,null,null,null,null,null,null,null,null,null,null,null,null,"gewonnen"]
[null,null,null,null,null,null,null,null,null,null,null,null,null,null,null,null,null,null,null,"verloren"]
[]
[null,null,null,null,null,null,null,null,null,null,null,null,null,"Schreiber:",null,null,null,null,"Kontrolle:"]
[]
[]
["1/2 Finale",null,null,null,null,{"$f":"MC8_Baum!$G$58","v":"Scheibe: 14"},null,null,null,null,null,null,"1./2. od. 3./4. Platz",null,null,null,null,"Scheibe:"]
[null,1,2,"Summe","Gesamt",null,null,null,null,null,null,null,null,1,2,"Summe","Gesamt"]
[1,null,null,null,null,null,null,null,null,null,null,null,1]
[]
[]
[2,null,null,null,null,null,null,null,null,null,null,null,2]
[]
[null,null,null,null,null,null,"Stechen (wenn erf.)",null,null,null,null,null,null,null,null,null,null,null,"Stechen (wenn erf.)"]
[3,null,null,null,null,null,1,null,null,null,null,null,3,null,null,null,null,null,1]
[null,null,null,null,null,null,2,null,null,null,null,null,null,null,null,null,null,null,2]
[null,null,null,null,null,null,3,null,null,null,null,null,null,null,null,null,null,null,3]
[4,null,null,null,null,null,null,null,null,null,null,null,4]
[]
[null,null,null,null,null,null,null,"gewonnen",null,null,null,null,null,null,null,null,null,null,null,"gewonnen"]
[null,null,null,null,null,null,null,"verloren",null,null,null,null,null,null,null,null,null,null,null,"verloren"]
[]
[null,"Schreiber:",null,null,null,null,"Kontrolle:",null,null,null,null,null,null,"Schreiber:",null,null,null,null,"Kontrolle:"]

{"sheet":"MCX8","index":21,"n_rows":318,"n_cols":20,"rows_kept":318,"cut":false,"hidden":true,"merged":[[1,0,1,9],[1,15,1,21],[2,0,2,9],[3,0,3,9],[3,15,4,21],[4,0,4,9],[13,0,14,0],[13,12,14,12],[15,12,16,12],[17,12,18,12],[25,0,25,4],[25,5,25,10],[25,12,25,16],[5,15,5,21],[9,0,9,4],[9,5,9,10],[9,12,9,16],[9,17,9,22],[11,0,12,0],[11,12,12,12],[5,2,5,10],[33,0,34,0],[33,12,34,12],[41,0,41,9],[41,15,41,21],[42,0,42,9],[43,0,43,9],[43,15,44,21],[44,0,44,9],[25,17,25,22],[27,0,28,0],[27,12,28,12],[29,0,30,0],[29,12,30,12],[31,0,32,0],[31,12,32,12],[53,0,54,0],[53,12,54,12],[55,12,56,12],[57,12,58,12],[65,0,65,4],[65,5,65,10],[65,12,65,16],[45,15,45,21],[49,0,49,4],[49,5,49,10],[49,12,49,16],[49,17,49,22],[51,0,52,0],[51,12,52,12],[45,2,45,10],[73,0,74,0],[73,12,74,12],[81,0,81,9],[81,15,81,21],[82,0,82,9],[83,0,83,9],[83,15,84,21],[84,0,84,9],[65,17,65,22],[67,0,68,0],[67,12,68,12],[69,0,70,0],[69,12,70,12],[71,0,72,0],[71,12,72,12],[93,0,94,0],[93,12,94,12],[95,12,96,12],[97,12,98,12],[105,0,105,4],[105,5,105,10],[105,12,105,16],[85,15,85,21],[89,0,89,4],[89,5,89,10],[89,12,89,16],[89,17,89,22],[91,0,92,0],[91,12,92,12],[85,2,85,10],[113,0,114,0],[113,12,114,12],[121,0,121,9],[121,15,121,21],[122,0,122,9],[123,0,123,9],[123,15,124,21],[124,0,124,9],[105,17,105,22],[107,0,108,0],[107,12,108,12],[109,0,110,0],[109,12,110,12],[111,0,112,0],[111,12,112,12],[133,0,134,0],[133,12,134,12],[135,12,136,12],[137,12,138,12],[145,0,145,4],[145,5,145,10],[145,12,145,16],[125,15,125,21],[129,0,129,4],[129,5,129,10],[129,12,129,16],[129,17,129,22],[131,0,132,0],[131,12,132,12],[125,2,125,10],[153,0,154,0],[153,12,154,12],[161,0,161,9],[161,15,161,21],[162,0,162,9],[163,0,163,9],[163,15,164,21],[164,0,164,9],[145,17,145,22],[147,0,148,0],[147,12,148,12],[149,0,150,0],[149,12,150,12],[151,0,152,0],[151,12,152,12],[173,0,174,0],[173,12,174,12],[175,12,176,12],[177,12,178,12],[185,0,185,4],[185,5,185,10],[185,12,185,16],[165,15,165,21],[169,0,169,4],[169,5,169,10],[169,12,169,16],[169,17,169,22],[171,0,172,0],[171,12,172,12],[165,2,165,10],[193,0,194,0],[193,12,194,12],[201,0,201,9],[201,15,201,21],[202,0,202,9],[203,0,203,9],[203,15,204,21],[204,0,204,9],[185,17,185,22],[187,0,188,0],[187,12,188,12],[189,0,190,0],[189,12,190,12],[191,0,192,0],[191,12,192,12],[213,0,214,0],[213,12,214,12],[215,12,216,12],[217,12,218,12],[225,0,225,4],[225,5,225,10],[225,12,225,16],[205,15,205,21],[209,0,209,4],[209,5,209,10],[209,12,209,16],[209,17,209,22],[211,0,212,0],[211,12,212,12],[205,2,205,10],[233,0,234,0],[233,12,234,12],[241,0,241,9],[241,15,241,21],[242,0,242,9],[243,0,243,9],[243,15,244,21],[244,0,244,9],[225,17,225,22],[227,0,228,0],[227,12,228,12],[229,0,230,0],[229,12,230,12],[231,0,232,0],[231,12,232,12],[253,0,254,0],[253,12,254,12],[255,12,256,12],[257,12,258,12],[265,0,265,4],[265,5,265,10],[265,12,265,16],[245,15,245,21],[249,0,249,4],[249,5,249,10],[249,12,249,16],[249,17,249,22],[251,0,252,0],[251,12,252,12],[245,2,245,10],[273,0,274,0],[273,12,274,12],[281,0,281,9],[281,15,281,21],[282,0,282,9],[283,0,283,9],[283,15,284,21],[284,0,284,9],[265,17,265,22],[267,0,268,0],[267,12,268,12],[269,0,270,0],[269,12,270,12],[271,0,272,0],[271,12,272,12],[293,0,294,0],[293,12,294,12],[295,12,296,12],[297,12,298,12],[305,0,305,4],[305,5,305,10],[305,12,305,16],[285,15,285,21],[289,0,289,4],[289,5,289,10],[289,12,289,16],[289,17,289,22],[291,0,292,0],[291,12,292,12],[285,2,285,10],[313,0,314,0],[313,12,314,12],[305,17,305,22],[307,0,308,0],[307,12,308,12],[309,0,310,0],[309,12,310,12],[311,0,312,0],[311,12,312,12]]}
[]
[{"$f":"Select!$C$12","v":"ÖM Indoor 2019"},null,null,null,null,null,null,null,null,null,null,null,"Mannschaft:",null,null,{"$f":"MC8_Baum!$C$6","v":"CM_1"}]
["Veranstaltung"]
[{"$f":"Select!$C$13","v":"09.-10. Februar 2019"},null,null,null,null,null,null,null,null,null,null,null,"Schützen:",null,null,{"$f":"MC8_Baum!$C$7","v":"Schütze1_CM1 Schütze2_CM1"}]
["Datum"]
["Bewerb:",null,{"$f":"Select!$C$14","v":"Mannschaftsbewerb"},null,null,null,null,null,null,null,null,null,"Bogenklasse:",null,null,{"$f":"Select!$C$20","v":"Compound Damen"}]
[]
[]
[]
[null,null,null,null,null,null,null,null,null,null,null,null,"1/4 Finale",null,null,null,null,{"$f":"MC8_Baum!$C$55","v":"Scheibe: 11"}]
[null,null,null,null,null,null,null,null,null,null,null,null,null,1,2,"Summe","Gesamt"]
[null,null,null,null,null,null,null,null,null,null,null,null,1]
[]
[null,null,null,null,null,null,null,null,null,null,null,null,2]
[null,null,null,null,null,null,null,null,null,null,null,null,null,null,null,null,null,null,"Stechen (wenn erf.)"]
[null,null,null,null,null,null,null,null,null,null,null,null,3,null,null,null,null,null,1]
[null,null,null,null,null,null,null,null,null,null,null,null,null,null,null,null,null,null,2]
[null,null,null,null,null,null,null,null,null,null,null,null,4]
[null,null,null,null,null,null,null,null,null,null,null,null,null,null,null,null,null,null,null,"gewonnen"]
[null,null,null,null,null,null,null,null,null,null,null,null,null,null,null,null,null,null,null,"verloren"]
[]
[null,null,null,null,null,null,null,null,null,null,null,null,null,"Schreiber:",null,null,null,null,"Kontrolle:"]
[]
[]
[]
["1/2 Finale",null,null,null,null,{"$f":"MC8_Baum!$G$55","v":"Scheibe: 11"},null,null,null,null,null,null,"1./2. od. 3./4. Platz",null,null,null,null,"Scheibe:"]
[null,1,2,"Summe","Gesamt",null,null,null,null,null,null,null,null,1,2,"Summe","Gesamt"]
[1,null,null,null,null,null,null,null,null,null,null,null,1]
[]
[2,null,null,null,null,null,null,null,null,null,null,null,2]
[null,null,null,null,null,null,"Stechen (wenn erf.)",null,null,null,null,null,null,null,null,null,null,null,"Stechen (wenn erf.)"]
[3,null,null,null,null,null,1,null,null,null,null,null,3,null,null,null,null,null,1]
[null,null,null,null,null,null,2,null,null,null,null,null,null,null,null,null,null,null,2]
[4,null,null,null,null,null,null,null,null,null,null,null,4]
[null,null,null,null,null,null,null,"gewonnen",null,null,null,null,null,null,null,null,null,null,null,"gewonnen"]
[null,null,null,null,null,null,null,"verloren",null,null,null,null,null,null,null,null,null,null,null,"verloren"]
[]
[null,"Schreiber:",null,null,null,null,"Kontrolle:",null,null,null,null,null,null,"Schreiber:",null,null,null,null,"Kontrolle:"]
[]
[]
[]
[{"$f":"Select!$C$12","v":"ÖM Indoor 2019"},null,null,null,null,null,null,null,null,null,null,null,"Mannschaft:",null,null,{"$f":"MC8_Baum!$C$8","v":"CM_8"}]
["Veranstaltung"]
[{"$f":"Select!$C$13","v":"09.-10. Februar 2019"},null,null,null,null,null,null,null,null,null,null,null,"Schützen:",null,null,{"$f":"MC8_Baum!$C$9","v":"Schütze1_CM8 Schütze2_CM8"}]
["Datum"]
["Bewerb:",null,{"$f":"Select!$C$14","v":"Mannschaftsbewerb"},null,null,null,null,null,null,null,null,null,"Bogenklasse:",null,null,{"$f":"Select!$C$20","v":"Compound Damen"}]
[]
[]
[]
[null,null,null,null,null,null,null,null,null,null,null,null,"1/4 Finale",null,null,null,null,{"$f":"MC8_Baum!$C$56","v":"Scheibe: 12"}]
[null,null,null,null,null,null,null,null,null,null,null,null,null,1,2,"Summe","Gesamt"]
[null,null,null,null,null,null,null,null,null,null,null,null,1]
[]
[null,null,null,null,null,null,null,null,null,null,null,null,2]
[null,null,null,null,null,null,null,null,null,null,null,null,null,null,null,null,null,null,"Stechen (wenn erf.)"]
[null,null,null,null,null,null,null,null,null,null,null,null,3,null,null,null,null,null,1]
[null,null,null,null,null,null,null,null,null,null,null,null,null,null,null,null,null,null,2]
[null,null,null,null,null,null,null,null,null,null,null,null,4]
[null,null,null,null,null,null,null,null,null,null,null,null,null,null,null,null,null,null,null,"gewonnen"]
[null,null,null,null,null,null,null,null,null,null,null,null,null,null,null,null,null,null,null,"verloren"]
[]
[null,null,null,null,null,null,null,null,null,null,null,null,null,"Schreiber:",null,null,null,null,"Kontrolle:"]
[]
[]
[]
["1/2 Finale",null,null,null,null,{"$f":"MC8_Baum!$G$55","v":"Scheibe: 11"},null,null,null,null,null,null,"1./2. od. 3./4. Platz",null,null,null,null,"Scheibe:"]
[null,1,2,"Summe","Gesamt",null,null,null,null,null,null,null,null,1,2,"Summe","Gesamt"]
[1,null,null,null,null,null,null,null,null,null,null,null,1]
[]
[2,null,null,null,null,null,null,null,null,null,null,null,2]
[null,null,null,null,null,null,"Stechen (wenn erf.)",null,null,null,null,null,null,null,null,null,null,null,"Stechen (wenn erf.)"]
[3,null,null,null,null,null,1,null,null,null,null,null,3,null,null,null,null,null,1]
[null,null,null,null,null,null,2,null,null,null,null,null,null,null,null,null,null,null,2]
[4,null,null,null,null,null,null,null,null,null,null,null,4]
[null,null,null,null,null,null,null,"gewonnen",null,null,null,null,null,null,null,null,null,null,null,"gewonnen"]
[null,null,null,null,null,null,null,"verloren",null,null,null,null,null,null,null,null,null,null,null,"verloren"]
[]
[null,"Schreiber:",null,null,null,null,"Kontrolle:",null,null,null,null,null,null,"Schreiber:",null,null,null,null,"Kontrolle:"]
[]
[]
[]
[{"$f":"Select!$C$12","v":"ÖM Indoor 2019"},null,null,null,null,null,null,null,null,null,null,null,"Mannschaft:",null,null,{"$f":"MC8_Baum!$C$18","v":"CM_5"}]
["Veranstaltung"]
[{"$f":"Select!$C$13","v":"09.-10. Februar 2019"},null,null,null,null,null,null,null,null,null,null,null,"Schützen:",null,null,{"$f":"MC8_Baum!$C$19","v":"Schütze1_CM5 Schütze2_CM5"}]
["Datum"]
["Bewerb:",null,{"$f":"Select!$C$14","v":"Mannschaftsbewerb"},null,null,null,null,null,null,null,null,null,"Bogenklasse:",null,null,{"$f":"Select!$C$20","v":"Compound Damen"}]
[]
[]
[]
[null,null,null,null,null,null,null,null,null,null,null,null,"1/4 Finale",null,null,null,null,{"$f":"MC8_Baum!$C$57","v":"Scheibe: 13"}]
[null,null,null,null,null,null,null,null,null,null,null,null,null,1,2,"Summe","Gesamt"]
[null,null,null,null,null,null,null,null,null,null,null,null,1]
[]
[null,null,null,null,null,null,null,null,null,null,null,null,2]
[null,null,null,null,null,null,null,null,null,null,null,null,null,null,null,null,null,null,"Stechen (wenn erf.)"]
[null,null,null,null,null,null,null,null,null,null,null,null,3,null,null,null,null,null,1]
[null,null,null,null,null,null,null,null,null,null,null,null,null,null,null,null,null,null,2]
[null,null,null,null,null,null,null,null,null,null,null,null,4]
[null,null,null,null,null,null,null,null,null,null,null,null,null,null,null,null,null,null,null,"gewonnen"]
[null,null,null,null,null,null,null,null,null,null,null,null,null,null,null,null,null,null,null,"verloren"]
[]
[null,null,null,null,null,null,null,null,null,null,null,null,null,"Schreiber:",null,null,null,null,"Kontrolle:"]
[]
[]
[]
["1/2 Finale",null,null,null,null,{"$f":"MC8_Baum!$G$56","v":"Scheibe: 12"},null,null,null,null,null,null,"1./2. od. 3./4. Platz",null,null,null,null,"Scheibe:"]
[null,1,2,"Summe","Gesamt",null,null,null,null,null,null,null,null,1,2,"Summe","Gesamt"]
[1,null,null,null,null,null,null,null,null,null,null,null,1]
[]
[2,null,null,null,null,null,null,null,null,null,null,null,2]
[null,null,null,null,null,null,"Stechen (wenn erf.)",null,null,null,null,null,null,null,null,null,null,null,"Stechen (wenn erf.)"]
[3,null,null,null,null,null,1,null,null,null,null,null,3,null,null,null,null,null,1]
[null,null,null,null,null,null,2,null,null,null,null,null,null,null,null,null,null,null,2]
[4,null,null,null,null,null,null,null,null,null,null,null,4]
[null,null,null,null,null,null,null,"gewonnen",null,null,null,null,null,null,null,null,null,null,null,"gewonnen"]
[null,null,null,null,null,null,null,"verloren",null,null,null,null,null,null,null,null,null,null,null,"verloren"]
[]
[null,"Schreiber:",null,null,null,null,"Kontrolle:",null,null,null,null,null,null,"Schreiber:",null,null,null,null,"Kontrolle:"]
[]
[]
[]
[{"$f":"Select!$C$12","v":"ÖM Indoor 2019"},null,null,null,null,null,null,null,null,null,null,null,"Mannschaft:",null,null,{"$f":"MC8_Baum!$C$20","v":"CM_4"}]
["Veranstaltung"]
[{"$f":"Select!$C$13","v":"09.-10. Februar 2019"},null,null,null,null,null,null,null,null,null,null,null,"Schützen:",null,null,{"$f":"MC8_Baum!$C$21","v":"Schütze1_CM4 Schütze2_CM4"}]
["Datum"]
["Bewerb:",null,{"$f":"Select!$C$14","v":"Mannschaftsbewerb"},null,null,null,null,null,null,null,null,null,"Bogenklasse:",null,null,{"$f":"Select!$C$20","v":"Compound Damen"}]
[]
[]
[]
[null,null,null,null,null,null,null,null,null,null,null,null,"1/4 Finale",null,null,null,null,{"$f":"MC8_Baum!$C$58","v":"Scheibe: 14"}]
[null,null,null,null,null,null,null,null,null,null,null,null,null,1,2,"Summe","Gesamt"]
[null,null,null,null,null,null,null,null,null,null,null,null,1]
[]
[null,null,null,null,null,null,null,null,null,null,null,null,2]
[null,null,null,null,null,null,null,null,null,null,null,null,null,null,null,null,null,null,"Stechen (wenn erf.)"]
[null,null,null,null,null,null,null,null,null,null,null,null,3,null,null,null,null,null,1]
[null,null,null,null,null,null,null,null,null,null,null,null,null,null,null,null,null,null,2]
[null,null,null,null,null,null,null,null,null,null,null,null,4]
[null,null,null,null,null,null,null,null,null,null,null,null,null,null,null,null,null,null,null,"gewonnen"]
[null,null,null,null,null,null,null,null,null,null,null,null,null,null,null,null,null,null,null,"verloren"]
[]
[null,null,null,null,null,null,null,null,null,null,null,null,null,"Schreiber:",null,null,null,null,"Kontrolle:"]
[]
[]
[]
["1/2 Finale",null,null,null,null,{"$f":"MC8_Baum!$G$56","v":"Scheibe: 12"},null,null,null,null,null,null,"1./2. od. 3./4. Platz",null,null,null,null,"Scheibe:"]
[null,1,2,"Summe","Gesamt",null,null,null,null,null,null,null,null,1,2,"Summe","Gesamt"]
[1,null,null,null,null,null,null,null,null,null,null,null,1]
[]
[2,null,null,null,null,null,null,null,null,null,null,null,2]
[null,null,null,null,null,null,"Stechen (wenn erf.)",null,null,null,null,null,null,null,null,null,null,null,"Stechen (wenn erf.)"]
[3,null,null,null,null,null,1,null,null,null,null,null,3,null,null,null,null,null,1]
[null,null,null,null,null,null,2,null,null,null,null,null,null,null,null,null,null,null,2]
[4,null,null,null,null,null,null,null,null,null,null,null,4]
[null,null,null,null,null,null,null,"gewonnen",null,null,null,null,null,null,null,null,null,null,null,"gewonnen"]
[null,null,null,null,null,null,null,"verloren",null,null,null,null,null,null,null,null,null,null,null,"verloren"]
[]
[null,"Schreiber:",null,null,null,null,"Kontrolle:",null,null,null,null,null,null,"Schreiber:",null,null,null,null,"Kontrolle:"]
[]
[]
[]
[{"$f":"Select!$C$12","v":"ÖM Indoor 2019"},null,null,null,null,null,null,null,null,null,null,null,"Mannschaft:",null,null,{"$f":"MC8_Baum!$C$30","v":"CM_3"}]
["Veranstaltung"]
[{"$f":"Select!$C$13","v":"09.-10. Februar 2019"},null,null,null,null,null,null,null,null,null,null,null,"Schützen:",null,null,{"$f":"MC8_Baum!$C$31","v":"Schütze1_CM3 Schütze2_CM3"}]
["Datum"]
["Bewerb:",null,{"$f":"Select!$C$14","v":"Mannschaftsbewerb"},null,null,null,null,null,null,null,null,null,"Bogenklasse:",null,null,{"$f":"Select!$C$20","v":"Compound Damen"}]
[]
[]
[]
[null,null,null,null,null,null,null,null,null,null,null,null,"1/4 Finale",null,null,null,null,{"$f":"MC8_Baum!$C$59","v":"Scheibe: 15"}]
[null,null,null,null,null,null,null,null,null,null,null,null,null,1,2,"Summe","Gesamt"]
[null,null,null,null,null,null,null,null,null,null,null,null,1]
[]
[null,null,null,null,null,null,null,null,null,null,null,null,2]
[null,null,null,null,null,null,null,null,null,null,null,null,null,null,null,null,null,null,"Stechen (wenn erf.)"]
[null,null,null,null,null,null,null,null,null,null,null,null,3,null,null,null,null,null,1]
[null,null,null,null,null,null,null,null,null,null,null,null,null,null,null,null,null,null,2]
[null,null,null,null,null,null,null,null,null,null,null,null,4]
[null,null,null,null,null,null,null,null,null,null,null,null,null,null,null,null,null,null,null,"gewonnen"]
[null,null,null,null,null,null,null,null,null,null,null,null,null,null,null,null,null,null,null,"verloren"]
[]
[null,null,null,null,null,null,null,null,null,null,null,null,null,"Schreiber:",null,null,null,null,"Kontrolle:"]
[]
[]
[]
["1/2 Finale",null,null,null,null,{"$f":"MC8_Baum!$G$57","v":"Scheibe: 13"},null,null,null,null,null,null,"1./2. od. 3./4. Platz",null,null,null,null,"Scheibe:"]
[null,1,2,"Summe","Gesamt",null,null,null,null,null,null,null,null,1,2,"Summe","Gesamt"]
[1,null,null,null,null,null,null,null,null,null,null,null,1]
[]
[2,null,null,null,null,null,null,null,null,null,null,null,2]
[null,null,null,null,null,null,"Stechen (wenn erf.)",null,null,null,null,null,null,null,null,null,null,null,"Stechen (wenn erf.)"]
[3,null,null,null,null,null,1,null,null,null,null,null,3,null,null,null,null,null,1]
[null,null,null,null,null,null,2,null,null,null,null,null,null,null,null,null,null,null,2]
[4,null,null,null,null,null,null,null,null,null,null,null,4]
[null,null,null,null,null,null,null,"gewonnen",null,null,null,null,null,null,null,null,null,null,null,"gewonnen"]
[null,null,null,null,null,null,null,"verloren",null,null,null,null,null,null,null,null,null,null,null,"verloren"]
[]
[null,"Schreiber:",null,null,null,null,"Kontrolle:",null,null,null,null,null,null,"Schreiber:",null,null,null,null,"Kontrolle:"]
[]
[]
[]
[{"$f":"Select!$C$12","v":"ÖM Indoor 2019"},null,null,null,null,null,null,null,null,null,null,null,"Mannschaft:",null,null,{"$f":"MC8_Baum!$C$32","v":"CM_6"}]
["Veranstaltung"]
[{"$f":"Select!$C$13","v":"09.-10. Februar 2019"},null,null,null,null,null,null,null,null,null,null,null,"Schützen:",null,null,{"$f":"MC8_Baum!$C$33","v":"Schütze1_CM6 Schütze2_CM6"}]
["Datum"]
["Bewerb:",null,{"$f":"Select!$C$14","v":"Mannschaftsbewerb"},null,null,null,null,null,null,null,null,null,"Bogenklasse:",null,null,{"$f":"Select!$C$20","v":"Compound Damen"}]
[]
[]
[]
[null,null,null,null,null,null,null,null,null,null,null,null,"1/4 Finale",null,null,null,null,{"$f":"MC8_Baum!$C$60","v":"Scheibe: 16"}]
[null,null,null,null,null,null,null,null,null,null,null,null,null,1,2,"Summe","Gesamt"]
[null,null,null,null,null,null,null,null,null,null,null,null,1]
[]
[null,null,null,null,null,null,null,null,null,null,null,null,2]
[null,null,null,null,null,null,null,null,null,null,null,null,null,null,null,null,null,null,"Stechen (wenn erf.)"]
[null,null,null,null,null,null,null,null,null,null,null,null,3,null,null,null,null,null,1]
[null,null,null,null,null,null,null,null,null,null,null,null,null,null,null,null,null,null,2]
[null,null,null,null,null,null,null,null,null,null,null,null,4]
[null,null,null,null,null,null,null,null,null,null,null,null,null,null,null,null,null,null,null,"gewonnen"]
[null,null,null,null,null,null,null,null,null,null,null,null,null,null,null,null,null,null,null,"verloren"]
[]
[null,null,null,null,null,null,null,null,null,null,null,null,null,"Schreiber:",null,null,null,null,"Kontrolle:"]
[]
[]
[]
["1/2 Finale",null,null,null,null,{"$f":"MC8_Baum!$G$57","v":"Scheibe: 13"},null,null,null,null,null,null,"1./2. od. 3./4. Platz",null,null,null,null,"Scheibe:"]
[null,1,2,"Summe","Gesamt",null,null,null,null,null,null,null,null,1,2,"Summe","Gesamt"]
[1,null,null,null,null,null,null,null,null,null,null,null,1]
[]
[2,null,null,null,null,null,null,null,null,null,null,null,2]
[null,null,null,null,null,null,"Stechen (wenn erf.)",null,null,null,null,null,null,null,null,null,null,null,"Stechen (wenn erf.)"]
[3,null,null,null,null,null,1,null,null,null,null,null,3,null,null,null,null,null,1]
[null,null,null,null,null,null,2,null,null,null,null,null,null,null,null,null,null,null,2]
[4,null,null,null,null,null,null,null,null,null,null,null,4]
[null,null,null,null,null,null,null,"gewonnen",null,null,null,null,null,null,null,null,null,null,null,"gewonnen"]
[null,null,null,null,null,null,null,"verloren",null,null,null,null,null,null,null,null,null,null,null,"verloren"]
[]
[null,"Schreiber:",null,null,null,null,"Kontrolle:",null,null,null,null,null,null,"Schreiber:",null,null,null,null,"Kontrolle:"]
[]
[]
[]
[{"$f":"Select!$C$12","v":"ÖM Indoor 2019"},null,null,null,null,null,null,null,null,null,null,null,"Mannschaft:",null,null,{"$f":"MC8_Baum!$C$42","v":"CM_7"}]
["Veranstaltung"]
[{"$f":"Select!$C$13","v":"09.-10. Februar 2019"},null,null,null,null,null,null,null,null,null,null,null,"Schützen:",null,null,{"$f":"MC8_Baum!$C$43","v":"Schütze1_CM7 Schütze2_CM7"}]
["Datum"]
["Bewerb:",null,{"$f":"Select!$C$14","v":"Mannschaftsbewerb"},null,null,null,null,null,null,null,null,null,"Bogenklasse:",null,null,{"$f":"Select!$C$20","v":"Compound Damen"}]
[]
[]
[]
[null,null,null,null,null,null,null,null,null,null,null,null,"1/4 Finale",null,null,null,null,{"$f":"MC8_Baum!$C$61","v":"Scheibe: 17"}]
[null,null,null,null,null,null,null,null,null,null,null,null,null,1,2,"Summe","Gesamt"]
[null,null,null,null,null,null,null,null,null,null,null,null,1]
[]
[null,null,null,null,null,null,null,null,null,null,null,null,2]
[null,null,null,null,null,null,null,null,null,null,null,null,null,null,null,null,null,null,"Stechen (wenn erf.)"]
[null,null,null,null,null,null,null,null,null,null,null,null,3,null,null,null,null,null,1]
[null,null,null,null,null,null,null,null,null,null,null,null,null,null,null,null,null,null,2]
[null,null,null,null,null,null,null,null,null,null,null,null,4]
[null,null,null,null,null,null,null,null,null,null,null,null,null,null,null,null,null,null,null,"gewonnen"]
[null,null,null,null,null,null,null,null,null,null,null,null,null,null,null,null,null,null,null,"verloren"]
[]
[null,null,null,null,null,null,null,null,null,null,null,null,null,"Schreiber:",null,null,null,null,"Kontrolle:"]
[]
[]
[]
["1/2 Finale",null,null,null,null,{"$f":"MC8_Baum!$G$58","v":"Scheibe: 14"},null,null,null,null,null,null,"1./2. od. 3./4. Platz",null,null,null,null,"Scheibe:"]
[null,1,2,"Summe","Gesamt",null,null,null,null,null,null,null,null,1,2,"Summe","Gesamt"]
[1,null,null,null,null,null,null,null,null,null,null,null,1]
[]
[2,null,null,null,null,null,null,null,null,null,null,null,2]
[null,null,null,null,null,null,"Stechen (wenn erf.)",null,null,null,null,null,null,null,null,null,null,null,"Stechen (wenn erf.)"]
[3,null,null,null,null,null,1,null,null,null,null,null,3,null,null,null,null,null,1]
[null,null,null,null,null,null,2,null,null,null,null,null,null,null,null,null,null,null,2]
[4,null,null,null,null,null,null,null,null,null,null,null,4]
[null,null,null,null,null,null,null,"gewonnen",null,null,null,null,null,null,null,null,null,null,null,"gewonnen"]
[null,null,null,null,null,null,null,"verloren",null,null,null,null,null,null,null,null,null,null,null,"verloren"]
[]
[null,"Schreiber:",null,null,null,null,"Kontrolle:",null,null,null,null,null,null,"Schreiber:",null,null,null,null,"Kontrolle:"]
[]
[]
[]
[{"$f":"Select!$C$12","v":"ÖM Indoor 2019"},null,null,null,null,null,null,null,null,null,null,null,"Mannschaft:",null,null,{"$f":"MC8_Baum!$C$44","v":"CM_2"}]
["Veranstaltung"]
[{"$f":"Select!$C$13","v":"09.-10. Februar 2019"},null,null,null,null,null,null,null,null,null,null,null,"Schützen:",null,null,{"$f":"MC8_Baum!$C$45","v":"Schütze1_CM2 Schütze2_CM2"}]
["Datum"]
["Bewerb:",null,{"$f":"Select!$C$14","v":"Mannschaftsbewerb"},null,null,null,null,null,null,null,null,null,"Bogenklasse:",null,null,{"$f":"Select!$C$20","v":"Compound Damen"}]
[]
[]
[]
[null,null,null,null,null,null,null,null,null,null,null,null,"1/4 Finale",null,null,null,null,{"$f":"MC8_Baum!$C$62","v":"Scheibe: 18"}]
[null,null,null,null,null,null,null,null,null,null,null,null,null,1,2,"Summe","Gesamt"]
[null,null,null,null,null,null,null,null,null,null,null,null,1]
[]
[null,null,null,null,null,null,null,null,null,null,null,null,2]
[null,null,null,null,null,null,null,null,null,null,null,null,null,null,null,null,null,null,"Stechen (wenn erf.)"]
[null,null,null,null,null,null,null,null,null,null,null,null,3,null,null,null,null,null,1]
[null,null,null,null,null,null,null,null,null,null,null,null,null,null,null,null,null,null,2]
[null,null,null,null,null,null,null,null,null,null,null,null,4]
[null,null,null,null,null,null,null,null,null,null,null,null,null,null,null,null,null,null,null,"gewonnen"]
[null,null,null,null,null,null,null,null,null,null,null,null,null,null,null,null,null,null,null,"verloren"]
[]
[null,null,null,null,null,null,null,null,null,null,null,null,null,"Schreiber:",null,null,null,null,"Kontrolle:"]
[]
[]
[]
["1/2 Finale",null,null,null,null,{"$f":"MC8_Baum!$G$58","v":"Scheibe: 14"},null,null,null,null,null,null,"1./2. od. 3./4. Platz",null,null,null,null,"Scheibe:"]
[null,1,2,"Summe","Gesamt",null,null,null,null,null,null,null,null,1,2,"Summe","Gesamt"]
[1,null,null,null,null,null,null,null,null,null,null,null,1]
[]
[2,null,null,null,null,null,null,null,null,null,null,null,2]
[null,null,null,null,null,null,"Stechen (wenn erf.)",null,null,null,null,null,null,null,null,null,null,null,"Stechen (wenn erf.)"]
[3,null,null,null,null,null,1,null,null,null,null,null,3,null,null,null,null,null,1]
[null,null,null,null,null,null,2,null,null,null,null,null,null,null,null,null,null,null,2]
[4,null,null,null,null,null,null,null,null,null,null,null,4]
[null,null,null,null,null,null,null,"gewonnen",null,null,null,null,null,null,null,null,null,null,null,"gewonnen"]
[null,null,null,null,null,null,null,"verloren",null,null,null,null,null,null,null,null,null,null,null,"verloren"]
[]
[null,"Schreiber:",null,null,null,null,"Kontrolle:",null,null,null,null,null,null,"Schreiber:",null,null,null,null,"Kontrolle:"]

{"sheet":"MC8_Ergebnis","index":22,"n_rows":17,"n_cols":15,"rows_kept":17,"cut":false,"hidden":true,"merged":[[6,9,6,15],[6,0,6,3],[2,0,2,3],[1,0,1,3],[4,0,4,7],[1,4,1,7]]}
[]
[{"$f":"Select!$C$12","v":"ÖM Indoor 2019"}]
[{"$f":"Select!C13","v":"09.-10. Februar 2019"}]
[]
["Ergebnisliste"]
[]
[{"$f":"CONCATENATE(Select!C14,\" \",Select!C20)","v":"Mannschaftsbewerb Compound Damen"},null,null,null,null,null,null,null,null,"!!!!!!!!!!!!!!!!!!!!!!!!!!  SORTIERBEREICH - NICHT ENTFERNEN !!!!!!!!!!!!!!!!!!!!!!!!!!"]
[]
["Pl.",null,"Mannschaft","Schützen","Quali.","1/4","1/2","Finale",null,"SortMannschaft","SortSchützen","SortQuali","Sort1/4","Sort1/2","SortFinale"]
[{"$f":"IF(C10<>\"\",1,\"\")","v":""},null,null,null,null,null,null,null,null,{"$f":"IF(MC8_Baum!$L$21>MC8_Baum!$L$23,MC8_Baum!$K$21,IF(MC8_Baum!$L$23>MC8_Baum!$L$21,MC8_Baum!$K$23,IF(RIGHT(MC8_Baum!$L$21,1)=\"*\",MC8_Baum!$K$21,IF(RIGHT(MC8_Baum!$L$23,1)=\"*\",MC8_Baum!$K$23,\"\"))))","v":""},{"$f":"IF(MC8_Baum!$L$21>MC8_Baum!$L$23,MC8_Baum!$K$22,IF(MC8_Baum!$L$23>MC8_Baum!$L$21,MC8_Baum!$K$24,IF(RIGHT(MC8_Baum!$L$21,1)=\"*\",MC8_Baum!$K$22,IF(RIGHT(MC8_Baum!$L$23,1)=\"*\",MC8_Baum!$K$24,\"\"))))","v":""},{"$f":"VLOOKUP(J10,MC_Quali!$C$10:$G$21,5,FALSE)","v":{"$error":"#N/A"}},{"$f":"VLOOKUP(J10,MC8_Baum!$C$6:$D$45,2,FALSE)","v":{"$error":"#N/A"}},{"$f":"VLOOKUP(J10,MC8_Baum!$G$12:$H$39,2,FALSE)","v":0},{"$f":"VLOOKUP(J10,MC8_Baum!$K$21:$L$30,2,FALSE)","v":0}]
[{"$f":"IF(C11<>\"\",A10+1,\"\")","v":""},null,null,null,null,null,null,null,null,{"$f":"IF(MC8_Baum!$L$21<MC8_Baum!$L$23,MC8_Baum!$K$21,IF(MC8_Baum!$L$23<MC8_Baum!$L$21,MC8_Baum!$K$23,IF(RIGHT(MC8_Baum!$L$21,1)=\"*\",MC8_Baum!$K$23,IF(RIGHT(MC8_Baum!$L$23,1)=\"*\",MC8_Baum!$K$21,\"\"))))","v":""},{"$f":"IF(MC8_Baum!$L$21<MC8_Baum!$L$23,MC8_Baum!$K$22,IF(MC8_Baum!$L$23<MC8_Baum!$L$21,MC8_Baum!$K$24,IF(RIGHT(MC8_Baum!$L$21,1)=\"*\",MC8_Baum!$K$24,IF(RIGHT(MC8_Baum!$L$23,1)=\"*\",MC8_Baum!$K$22,\"\"))))","v":""},{"$f":"VLOOKUP(J11,MC_Quali!$C$10:$G$21,5,FALSE)","v":{"$error":"#N/A"}},{"$f":"VLOOKUP(J11,MC8_Baum!$C$6:$D$45,2,FALSE)","v":{"$error":"#N/A"}},{"$f":"VLOOKUP(J11,MC8_Baum!$G$12:$H$39,2,FALSE)","v":0},{"$f":"VLOOKUP(J11,MC8_Baum!$K$21:$L$30,2,FALSE)","v":0}]
["",null,null,null,null,null,null,null,null,{"$f":"IF(MC8_Baum!$L$27>MC8_Baum!$L$29,MC8_Baum!$K$27,IF(MC8_Baum!$L$29>MC8_Baum!$L$27,MC8_Baum!$K$29,IF(RIGHT(MC8_Baum!$L$27,1)=\"*\",MC8_Baum!$K$27,IF(RIGHT(MC8_Baum!$L$29,1)=\"*\",MC8_Baum!$K$29,\"\"))))","v":""},{"$f":"IF(MC8_Baum!$L$27>MC8_Baum!$L$29,MC8_Baum!$K$28,IF(MC8_Baum!$L$29>MC8_Baum!$L$27,MC8_Baum!$K$30,IF(RIGHT(MC8_Baum!$L$27,1)=\"*\",MC8_Baum!$K$28,IF(RIGHT(MC8_Baum!$L$29,1)=\"*\",MC8_Baum!$K$30,\"\"))))","v":""},{"$f":"VLOOKUP(J12,MC_Quali!$C$10:$G$21,5,FALSE)","v":{"$error":"#N/A"}},{"$f":"VLOOKUP(J12,MC8_Baum!$C$6:$D$45,2,FALSE)","v":{"$error":"#N/A"}},{"$f":"VLOOKUP(J12,MC8_Baum!$G$12:$H$39,2,FALSE)","v":0},{"$f":"VLOOKUP(J12,MC8_Baum!$K$21:$L$30,2,FALSE)","v":0}]
["",null,null,null,null,null,null,null,null,{"$f":"IF(MC8_Baum!$L$27<MC8_Baum!$L$29,MC8_Baum!$K$27,IF(MC8_Baum!$L$29<MC8_Baum!$L$27,MC8_Baum!$K$29,IF(RIGHT(MC8_Baum!$L$27,1)=\"*\",MC8_Baum!$K$29,IF(RIGHT(MC8_Baum!$L$29,1)=\"*\",MC8_Baum!$K$27,\"\"))))","v":""},{"$f":"IF(MC8_Baum!$L$27<MC8_Baum!$L$29,MC8_Baum!$K$28,IF(MC8_Baum!$L$29<MC8_Baum!$L$27,MC8_Baum!$K$30,IF(RIGHT(MC8_Baum!$L$27,1)=\"*\",MC8_Baum!$K$30,IF(RIGHT(MC8_Baum!$L$29,1)=\"*\",MC8_Baum!$K$28,\"\"))))","v":""},{"$f":"VLOOKUP(J13,MC_Quali!$C$10:$G$21,5,FALSE)","v":{"$error":"#N/A"}},{"$f":"VLOOKUP(J13,MC8_Baum!$C$6:$D$45,2,FALSE)","v":{"$error":"#N/A"}},{"$f":"VLOOKUP(J13,MC8_Baum!$G$12:$H$39,2,FALSE)","v":0},{"$f":"VLOOKUP(J13,MC8_Baum!$K$21:$L$30,2,FALSE)","v":0}]
["",null,null,null,null,null,null,null,null,{"$f":"IF(MC8_Baum!$D$6<MC8_Baum!$D$8,MC8_Baum!$C$6,IF(MC8_Baum!$D$8<MC8_Baum!$D$6,MC8_Baum!$C$8,IF(RIGHT(MC8_Baum!$D$6,1)=\"*\",MC8_Baum!$C$8,IF(RIGHT(MC8_Baum!$D$8,1)=\"*\",MC8_Baum!$C$6,\"\"))))","v":""},{"$f":"IF(MC8_Baum!$D$6<MC8_Baum!$D$8,MC8_Baum!$C$7,IF(MC8_Baum!$D$8<MC8_Baum!$D$6,MC8_Baum!$C$9,IF(RIGHT(MC8_Baum!$D$6,1)=\"*\",MC8_Baum!$C$9,IF(RIGHT(MC8_Baum!$D$8,1)=\"*\",MC8_Baum!$C$7,\"\"))))","v":""},{"$f":"VLOOKUP(J14,MC_Quali!$C$10:$G$21,5,FALSE)","v":{"$error":"#N/A"}},{"$f":"VLOOKUP(J14,MC8_Baum!$C$6:$D$45,2,FALSE)","v":{"$error":"#N/A"}}]
["",null,null,null,null,null,null,null,null,{"$f":"IF(MC8_Baum!$D$18<MC8_Baum!$D$20,MC8_Baum!$C$18,IF(MC8_Baum!$D$20<MC8_Baum!$D$18,MC8_Baum!$C$20,IF(RIGHT(MC8_Baum!$D$18,1)=\"*\",MC8_Baum!$C$20,IF(RIGHT(MC8_Baum!$D$20,1)=\"*\",MC8_Baum!$C$18,\"\"))))","v":""},{"$f":"IF(MC8_Baum!$D$18<MC8_Baum!$D$20,MC8_Baum!$C$19,IF(MC8_Baum!$D$20<MC8_Baum!$D$18,MC8_Baum!$C$21,IF(RIGHT(MC8_Baum!$D$18,1)=\"*\",MC8_Baum!$C$21,IF(RIGHT(MC8_Baum!$D$20,1)=\"*\",MC8_Baum!$C$19,\"\"))))","v":""},{"$f":"VLOOKUP(J15,MC_Quali!$C$10:$G$21,5,FALSE)","v":{"$error":"#N/A"}},{"$f":"VLOOKUP(J15,MC8_Baum!$C$6:$D$45,2,FALSE)","v":{"$error":"#N/A"}}]
["",null,null,null,null,null,null,null,null,{"$f":"IF(MC8_Baum!$D$30<MC8_Baum!$D$32,MC8_Baum!$C$30,IF(MC8_Baum!$D$32<MC8_Baum!$D$30,MC8_Baum!$C$32,IF(RIGHT(MC8_Baum!$D$30,1)=\"*\",MC8_Baum!$C$32,IF(RIGHT(MC8_Baum!$D$32,1)=\"*\",MC8_Baum!$C$30,\"\"))))","v":""},{"$f":"IF(MC8_Baum!$D$30<MC8_Baum!$D$32,MC8_Baum!$C$31,IF(MC8_Baum!$D$32<MC8_Baum!$D$30,MC8_Baum!$C$33,IF(RIGHT(MC8_Baum!$D$30,1)=\"*\",MC8_Baum!$C$33,IF(RIGHT(MC8_Baum!$D$32,1)=\"*\",MC8_Baum!$C$31,\"\"))))","v":""},{"$f":"VLOOKUP(J16,MC_Quali!$C$10:$G$21,5,FALSE)","v":{"$error":"#N/A"}},{"$f":"VLOOKUP(J16,MC8_Baum!$C$6:$D$45,2,FALSE)","v":{"$error":"#N/A"}}]
["",null,null,null,null,null,null,null,null,{"$f":"IF(MC8_Baum!$D$42<MC8_Baum!$D$44,MC8_Baum!$C$42,IF(MC8_Baum!$D$44<MC8_Baum!$D$42,MC8_Baum!$C$44,IF(RIGHT(MC8_Baum!$D$42,1)=\"*\",MC8_Baum!$C$44,IF(RIGHT(MC8_Baum!$D$44,1)=\"*\",MC8_Baum!$C$42,\"\"))))","v":""},{"$f":"IF(MC8_Baum!$D$42<MC8_Baum!$D$44,MC8_Baum!$C$43,IF(MC8_Baum!$D$44<MC8_Baum!$D$42,MC8_Baum!$C$45,IF(RIGHT(MC8_Baum!$D$42,1)=\"*\",MC8_Baum!$C$45,IF(RIGHT(MC8_Baum!$D$44,1)=\"*\",MC8_Baum!$C$43,\"\"))))","v":""},{"$f":"VLOOKUP(J17,MC_Quali!$C$10:$G$21,5,FALSE)","v":{"$error":"#N/A"}},{"$f":"VLOOKUP(J17,MC8_Baum!$C$6:$D$45,2,FALSE)","v":{"$error":"#N/A"}}]